program: Gaussian 09
title: 000115914
version: EM64L-G09RevD.01
frameworkgroup: C1[X(C21H28N2O)]
method: RPBEPBE
basis: SDD
operation: Freq
keyword: #p
keyword: freq=noraman
keyword: PBEPBE/SDD
title: #p freq=noraman PBEPBE/SDD
converged: YES YES NO NO
title: Mulliken charges:
elementType: O N N C C C C C C C C C C C C C C C C C C C C C H H H H H H H H H H H H H H H H H H H H H H H H H H H H
charge: -0.444653 -0.094348 -0.697652 0.259139 -0.541287 -0.503010 -0.382608 -0.495724 0.442432 -0.374055 -0.377551 -0.575387 -0.537654 -0.403093 -0.700275 0.278060 -0.221811 0.526902 -0.421739 -0.408105 -0.408647 -0.414831 -0.414598 0.479470 0.216257 0.244722 0.189319 0.240020 0.222720 0.197227 0.197499 0.197918 0.193022 0.223426 0.212248 0.228729 0.214075 0.213034 0.252187 0.287556 0.206663 0.211361 0.217326 0.220621 0.217506 0.225179 0.226908 0.351411 0.210808 0.211082 0.301168 0.301032
chargesum: 0.00000
title: Mulliken charges with hydrogens summed into heavy atoms:
elementType: O N N C C C C C C C C C C C C C C C C C C C C C
charge: -0.093243 -0.094348 -0.095452 0.259139 -0.080309 -0.073671 0.037339 -0.100307 0.442432 0.042394 0.063426 -0.148278 -0.285467 -0.115538 -0.064925 0.278060 -0.001190 0.526902 -0.204233 -0.182926 -0.181738 -0.204023 -0.203516 0.479470
polarizability: 3.39265174e+02 -2.41870761e+01 2.10077219e+02 1.06332600e+01 2.23961247e+01 1.92065082e+02
1716.lowfreq: -3.4191 -0.0001 0.0007 0.0010 3.6729 8.3441 15.7398 17.8350 20.5130
frequency: 15.7018 17.6667 20.2391 30.1541 53.0590 57.8016 73.2582 82.4604 96.4085 127.0079 150.6277 162.8700 170.8709 212.2360 227.1001 237.4758 257.2912 282.9682 289.0295 297.6277 315.7437 320.3839 326.7940 346.5393 359.0795 363.3949 381.0442 395.2717 409.9904 413.8713 442.3096 465.8747 497.5427 518.8558 526.6626 545.1495 590.3486 631.7789 639.7950 659.4158 689.6786 709.6787 724.4992 744.9958 776.5807 782.4138 787.3413 809.2469 816.2705 823.2396 833.4974 842.0886 862.0232 866.1646 886.1074 891.3794 894.9402 924.7369 935.1182 952.0514 966.8068 975.0392 988.4142 992.0886 1000.9661 1008.8789 1024.4196 1034.5035 1041.7745 1051.6093 1062.9496 1079.9975 1106.2404 1111.1358 1119.8479 1133.4568 1143.4906 1149.4047 1160.2893 1174.6587 1179.8399 1186.3592 1186.9995 1208.6186 1218.9462 1225.2013 1231.1768 1244.5464 1275.3720 1280.4315 1286.9572 1289.5017 1292.2770 1307.4167 1310.2670 1318.8952 1319.9722 1334.7756 1343.3155 1357.4989 1378.0370 1381.7280 1384.2961 1385.6227 1432.5411 1459.0489 1464.6814 1466.5874 1473.1976 1475.5112 1476.4425 1479.8870 1480.8529 1486.6904 1491.6621 1500.6974 1519.7367 1582.1144 1587.3071 1625.8174 1632.6820 1644.3112 2833.8017 2859.2819 2928.6689 2965.3906 2969.6266 2979.9389 2984.0965 2988.4190 2998.3735 3005.3107 3009.9449 3014.0884 3035.8432 3048.3129 3067.4676 3070.3218 3070.4279 3104.7265 3106.6434 3111.6239 3127.1874 3131.3268 3134.3971 3149.9431 3158.9267 3569.6568 3582.7400 3710.2216
redmass: 3.9019 5.0655 4.5185 4.4365 3.7175 3.9181 3.5318 2.3751 1.7895 3.2352 4.1540 3.1754 3.7416 1.9784 2.8272 2.2934 3.0692 2.3950 2.5360 2.8462 1.2662 2.4776 2.6716 1.1175 1.0475 3.4307 4.2090 2.5603 2.7076 3.5426 3.4075 3.2895 4.1141 5.6097 2.6088 3.0130 3.8062 4.3121 6.6191 3.3939 4.8124 2.1187 3.3487 1.1255 2.9486 1.5324 1.2970 1.9193 1.2645 2.3004 3.1256 3.2830 1.7708 2.1618 1.4565 1.5032 1.9183 2.2545 1.4023 1.3562 1.7934 1.5451 3.8693 1.7371 2.8346 1.7642 2.2356 2.1257 2.3076 2.0163 2.2027 2.0336 1.9722 1.7021 2.0692 1.3919 1.5011 1.4620 1.8353 1.2930 1.6919 1.2592 1.1225 1.7322 2.0496 1.6142 1.6501 2.0337 1.3281 1.3363 1.2566 1.3256 1.3306 1.3550 3.0514 1.3353 1.5133 1.4093 1.4359 1.5038 1.5553 4.9141 5.4933 1.2134 3.2172 2.4544 1.1139 1.1772 1.0883 1.0761 1.1001 1.7834 1.1059 1.0845 1.1017 1.0939 3.1121 6.6676 6.2574 6.1814 1.9036 2.0321 1.0703 1.0713 1.0660 1.0572 1.0385 1.0631 1.0631 1.0801 1.0765 1.0888 1.0955 1.0868 1.1013 1.1021 1.1013 1.1012 1.0994 1.0865 1.0865 1.0877 1.0962 1.0909 1.0971 1.0979 1.0912 1.0448 1.0659 1.1040
irintensity: 0.0616 0.1520 0.0317 0.6887 0.2868 0.7107 0.2977 0.9325 0.6242 0.5233 3.6238 2.1860 5.8597 0.1950 0.6604 1.5154 2.8478 3.5197 0.1946 2.2228 281.8728 24.8963 13.3971 136.2261 0.9043 0.3502 7.8679 0.5264 0.0596 5.5972 2.7551 2.2099 6.8579 6.9978 23.2568 1.1829 5.3844 1.2700 0.2292 1.5881 0.0793 35.1585 0.4426 10.6082 5.2824 41.5559 3.2744 23.5281 0.3408 46.2469 7.4526 17.4763 13.1428 18.4250 4.5549 12.5426 2.3807 36.5739 0.1771 0.0878 7.7711 4.0127 0.7028 3.9195 0.2554 1.1676 3.9109 3.3098 0.1264 9.6204 11.7556 15.3405 23.4650 9.1251 24.7145 28.5694 42.7262 139.4319 7.9725 7.1909 41.0514 45.6186 5.0218 3.9298 0.4334 3.6292 36.5987 4.3415 4.9726 8.5143 1.0347 6.8036 3.5667 39.2770 65.1606 3.5439 3.6647 23.5006 8.3046 1.7381 3.9209 17.2484 8.9186 13.0809 0.3365 6.3937 11.6998 10.2271 5.7324 19.5275 6.5971 42.0054 6.0164 11.1119 7.1430 21.6268 153.8488 2.8980 65.4319 72.8440 0.8312 283.9184 94.8230 125.5867 78.9874 10.8936 55.1170 18.5469 21.2573 45.8087 61.2751 29.3958 23.6972 17.9580 14.6110 31.2174 55.4208 75.4055 42.5076 1.7734 45.8491 18.7093 51.5806 4.6838 2.4072 30.2033 4.1063 70.8799 32.0908 18.7894
temp: 298.150 k
press: 1.00000 atm
elementType: 8 7 7 6 6 6 6 6 6 6 6 6 6 6 6 6 6 6 6 6 6 6 6 6 1 1 1 1 1 1 1 1 1 1 1 1 1 1 1 1 1 1 1 1 1 1 1 1 1 1 1 1
symmnumber: 1
zpe: 1165248.0 jmol-1
zpe.correction: 0.443820 hartree
zpe.thermalcorrener: 0.467931 hartree
zpe.thermalcorrenthalpy: 0.468875 hartree
zpe.thermalcorrgfe: 0.387273 hartree
zpe.sumelectzpe: -999.953543 hartree
zpe.sumelectthermal: -999.929432 hartree
zpe.sumelectthermalent: -999.928487 hartree
zpe.sumelectthermalfe: -1000.010090 hartree
dipole: -2.5329 0.1286 -0.4644
dipole: 2.5784
quadrupole: -112.9888 -139.2763 -140.0967
quadrupole: -15.1406 1.5002 6.5154
quadrupole: 17.7985 -8.4890 -9.3094 -15.1406 1.5002 6.5154
hfenergy: -1000.3973623 hartree
pointgroup: C01 [X(C21H28N2O1)]
dipole: 0.9949826 0.0351101 0.19445 debye
polarizability: 339.1812785|23.2127784|212.8734227|13.494038|-20.8119612|189.3527742 unknown
InChI: InChI=1S/C21H28N2O/c1-2-11-21(18-4-3-5-20(24)15-18)12-14-23(16-21)13-10-17-6-8-19(22)9-7-17/h3-9,15,24H,2,10-14,16,22H2,1H3
charge 0 multiplicity 1
52 atoms
O  -6.422241 -1.515325 -0.512968
N  0.144181 0.197486 -0.312632
N  8.036923 0.333971 0.703255
C  -2.14009 0.995402 -0.375421
C  -1.594126 0.905634 -1.84776
C  -0.800931 1.082373 0.412533
C  -0.274804 0.096769 -1.743684
C  -2.972963 2.294344 -0.17444
C  -2.947816 -0.283768 -0.050907
C  1.57234 0.441777 -0.060511
C  -3.454796 2.544293 1.273196
C  2.462775 -0.77241 -0.44197
C  -4.322062 -0.362238 -0.389644
C  -2.332881 -1.426662 0.531305
C  -4.312451 3.822466 1.392477
C  -5.060388 -1.539228 -0.143114
C  -3.079916 -2.59835 0.777206
C  3.933876 -0.515092 -0.156674
C  -4.451238 -2.670853 0.446516
C  4.764575 0.144118 -1.099484
C  4.518827 -0.879803 1.083286
C  6.117297 0.429014 -0.825882
C  5.869403 -0.604404 1.377123
C  6.694163 0.058724 0.42319
H  -1.386959 1.930751 -2.211083
H  -2.324714 0.443313 -2.533065
H  -0.460668 2.148458 0.41881
H  -0.903594 0.760571 1.466263
H  -0.426293 -0.962744 -2.027831
H  0.501611 0.517821 -2.420426
H  -3.850336 2.29414 -0.851897
H  -2.345998 3.151454 -0.497432
H  1.945529 1.345841 -0.610153
H  1.705605 0.650166 1.018532
H  -2.57698 2.627501 1.944714
H  -4.038036 1.671582 1.62379
H  2.315476 -0.998191 -1.516209
H  2.097482 -1.650373 0.123393
H  -4.852656 0.47909 -0.845328
H  -1.260149 -1.398448 0.748613
H  -3.748899 4.714985 1.059247
H  -5.222484 3.748317 0.767204
H  -4.634592 3.996734 2.435572
H  -2.589222 -3.469367 1.226407
H  -5.028298 -3.58503 0.638938
H  4.346819 0.433181 -2.072704
H  3.905697 -1.396216 1.833343
H  -6.854509 -2.379287 -0.300317
H  6.734828 0.935209 -1.578865
H  6.29318 -0.905756 2.343622
H  8.447743 0.068911 1.593031
H  8.62496 0.803651 0.021835
