program: Gaussian 09
title: 000115911
version: EM64L-G09RevD.01
frameworkgroup: C1[X(C9H21N2O2)]
method: RPBEPBE
basis: SDD
operation: Freq
keyword: #p
keyword: freq=noraman
keyword: PBEPBE/SDD
title: #p freq=noraman PBEPBE/SDD
converged: YES YES NO NO
title: Mulliken charges:
elementType: O O N N C C C C C C C C C H H H H H H H H H H H H H H H H H H H H H
charge: -0.319195 -0.266253 -0.113265 -0.357258 -0.356224 -0.550816 -0.535605 -0.549094 -0.274100 -0.371156 0.303552 -0.339733 -0.681440 0.278728 0.279335 0.273135 0.263749 0.276825 0.270938 0.265867 0.271024 0.272269 0.276185 0.263784 0.249359 0.249389 0.259591 0.228799 0.222812 0.217728 0.332948 0.218161 0.243791 0.196171
chargesum: 1.00000
title: Mulliken charges with hydrogens summed into heavy atoms:
elementType: O O N N C C C C C C C C C
charge: -0.319195 -0.266253 -0.113265 -0.024310 0.201840 0.262893 0.272224 0.263143 0.224648 0.117234 0.303552 0.100807 -0.023318
polarizability: 1.55073740e+02 -2.10905648e+00 1.06106076e+02 2.54942538e+00 -3.75740121e+00 9.47684519e+01
1716.lowfreq: -12.6152 -7.8598 -0.0011 -0.0010 -0.0007 2.2837 5.4873 11.8389 27.6907
frequency: -7.5386 10.1319 27.5355 51.7597 76.5093 87.0958 96.6565 142.8185 187.6605 201.9011 215.5941 229.3534 258.4879 265.9608 269.4490 324.4093 342.6906 366.8839 428.4118 432.8151 448.8861 479.2274 543.3194 594.9192 648.4030 684.2568 736.0562 759.5833 800.2193 832.3661 869.6640 887.2068 920.9069 922.6111 941.3271 970.3878 1032.1108 1045.4332 1055.5983 1073.5920 1092.0819 1104.9154 1121.4191 1137.7640 1138.7457 1187.0381 1191.1155 1217.0113 1250.1134 1251.9115 1253.8153 1279.4828 1302.7964 1332.9020 1346.7369 1358.3591 1390.0715 1395.4357 1423.3153 1425.8683 1447.7247 1453.8146 1461.2140 1462.8094 1464.7429 1466.8554 1471.9092 1478.1399 1483.4425 1485.9693 1486.6975 1490.6592 1497.3804 1501.7367 1715.5297 2975.1065 2994.8232 3001.7049 3006.1675 3025.8426 3027.7103 3030.9587 3036.9887 3043.7882 3064.4179 3071.4823 3084.4250 3088.7750 3113.7711 3142.0148 3143.7005 3146.3797 3149.0494 3153.0427 3156.9696 3565.2831
redmass: 2.8651 3.5083 3.9690 3.3589 1.7790 2.5151 2.7250 2.9820 1.2584 2.7501 3.0930 1.4640 1.1326 1.1638 3.0116 2.2426 2.2315 2.6985 2.7208 2.2886 2.6249 2.4308 3.2662 1.2134 5.5448 11.0520 3.0817 1.5395 1.1646 2.7915 2.0193 3.1344 2.3322 2.6960 2.7239 2.4711 3.4886 1.1968 1.2820 2.0670 2.9998 2.1937 1.7015 1.8440 1.5074 2.2755 1.3051 1.7964 1.1988 1.3126 1.9384 1.2109 1.3087 1.2971 1.4192 1.2592 1.3480 1.2225 1.1557 1.1451 1.0967 1.0461 1.0982 1.0757 1.0397 1.0805 1.0742 1.1029 1.2666 1.0550 1.0594 1.0862 1.2511 1.0654 10.2262 1.0374 1.0612 1.0655 1.0565 1.0324 1.0322 1.0350 1.0566 1.0990 1.1072 1.1006 1.0984 1.1004 1.1085 1.1057 1.1060 1.1052 1.1054 1.1058 1.1052 1.0772
irintensity: 0.1390 0.0600 4.4782 2.2933 2.8221 4.0399 3.1920 4.8005 0.4929 2.0534 1.9921 1.2020 0.6349 1.4605 12.8569 0.3794 0.0235 11.0376 5.9721 0.0210 4.0120 7.6089 5.3841 117.4792 12.4304 19.0742 1.2432 8.6004 4.5750 58.8190 8.9571 98.3696 39.9816 14.4116 54.7281 20.9588 151.0651 0.2218 0.0585 9.2480 47.8065 31.0281 2.1426 3.4766 0.8677 164.6087 0.4085 0.4253 31.3376 0.7499 0.1582 59.4785 2.2260 1.2910 1.4799 2.0109 3.9323 22.2735 14.3335 20.7083 3.5162 0.9067 2.6398 9.6884 0.4063 22.9706 3.3520 74.7487 128.2730 49.4117 43.5040 65.3541 91.5482 56.6142 341.2558 26.0450 22.6921 27.4630 31.7410 1.9009 2.1141 3.5440 4.0837 1.9630 13.3273 78.5101 20.8874 20.4308 6.2557 0.5927 0.6395 2.9324 9.1698 1.5860 5.4608 43.3497
temp: 298.150 k
press: 1.00000 atm
elementType: 8 8 7 7 6 6 6 6 6 6 6 6 6 1 1 1 1 1 1 1 1 1 1 1 1 1 1 1 1 1 1 1 1 1
symmnumber: 1
zpe: 794644.1 jmol-1
zpe.correction: 0.302664 hartree
zpe.thermalcorrener: 0.318567 hartree
zpe.thermalcorrenthalpy: 0.319512 hartree
zpe.thermalcorrgfe: 0.257141 hartree
zpe.sumelectzpe: -614.179344 hartree
zpe.sumelectthermal: -614.163441 hartree
zpe.sumelectthermalent: -614.162496 hartree
zpe.sumelectthermalfe: -614.224867 hartree
dipole: 12.9244 2.9763 -0.6550
dipole: 13.2788
quadrupole: 5.9084 -77.2288 -72.5421
quadrupole: 0.1827 3.7363 1.4893
quadrupole: 53.8626 -29.2746 -24.5879 0.1827 3.7363 1.4893
hfenergy: -614.482008 hartree
pointgroup: C01 [X(C9H21N2O2)]
dipole: 5.1150731 -0.9776483 0.4162976 debye
polarizability: 154.9183067|2.9901319|104.7427674|-3.0171033|-5.4550342|96.2871933 unknown
InChI: InChI=1S/C9H21N2O2/c1-5-6-10-9(12)13-8-7-11(2,3)4/h10H,5-8H2,1-4H3
charge 1 multiplicity 1
34 atoms
O  -0.196146 -0.129899 0.379891
O  -1.289364 1.654386 -0.713951
N  3.555861 -0.159386 -0.069648
N  -2.477053 0.051416 0.552308
C  2.108793 -0.516417 0.345922
C  3.958239 1.212446 0.475309
C  4.485955 -1.220031 0.525423
C  3.703768 -0.16913 -1.592134
C  1.036698 0.461628 -0.154487
C  -3.843092 0.577122 0.328817
C  -1.375958 0.630092 0.004173
C  -4.703749 -0.334244 -0.575099
C  -4.956801 -1.737573 0.016916
H  1.903531 -1.526918 -0.046221
H  2.092762 -0.555591 1.448343
H  3.780663 1.233395 1.561335
H  5.026703 1.376095 0.266995
H  3.363403 1.994866 -0.01638
H  4.194926 -2.209814 0.142315
H  5.522807 -0.995284 0.232434
H  4.394993 -1.203157 1.622051
H  3.359857 -1.140331 -1.979344
H  3.102789 0.641251 -2.027886
H  4.764231 -0.019137 -1.846259
H  1.161402 1.485976 0.241434
H  0.976549 0.519418 -1.256617
H  -3.731415 1.576436 -0.124434
H  -4.33136 0.701846 1.314404
H  -5.671968 0.178919 -0.733047
H  -4.223781 -0.41797 -1.568731
H  -2.35128 -0.797104 1.106316
H  -5.439223 -1.67286 1.010497
H  -5.623841 -2.324744 -0.637933
H  -4.019195 -2.316102 0.12519
