program: Gaussian 09
title: 000115896
version: EM64L-G09RevD.01
frameworkgroup: C1[X(C17H36N2)]
method: RPBEPBE
basis: SDD
operation: Freq
keyword: #p
keyword: freq=noraman
keyword: PBEPBE/SDD
title: #p freq=noraman PBEPBE/SDD
converged: NO YES NO NO
title: Mulliken charges:
elementType: N N C C C C C C C C C C C C C C C C C H H H H H H H H H H H H H H H H H H H H H H H H H H H H H H H H H H H H
charge: -0.086775 -0.086060 -0.340222 -0.347952 -0.340483 -0.348488 -0.349352 -0.349506 -0.452275 -0.445481 -0.452338 -0.444192 -0.415906 -0.416067 -0.399734 -0.399566 -0.364636 -0.582122 -0.584012 0.259834 0.267975 0.259025 0.260879 0.260604 0.267560 0.259333 0.261279 0.266568 0.268923 0.267413 0.268031 0.272176 0.242370 0.242337 0.266664 0.272331 0.241664 0.241867 0.267062 0.236938 0.236396 0.234539 0.238846 0.273664 0.218873 0.273704 0.219049 0.220497 0.216079 0.282742 0.262065 0.266509 0.266230 0.282872 0.262267
chargesum: 2.00000
title: Mulliken charges with hydrogens summed into heavy atoms:
elementType: N N C C C C C C C C C C C C C C C C C
charge: -0.086775 -0.086060 0.187587 0.171953 0.187682 0.172123 0.186139 0.185937 0.062271 0.063520 0.061657 0.064737 0.057428 0.057319 0.092803 0.093187 0.071939 0.229194 0.227357
polarizability: 2.36609358e+02 1.82354403e-01 1.63615445e+02 -3.81570778e+00 1.53988021e-01 1.60179917e+02
1716.lowfreq: -24.1967 -6.8796 -0.0009 0.0008 0.0013 4.8934 13.0071 24.0004 41.6444
frequency: -12.3058 22.5731 41.6127 59.0365 71.6075 110.2930 115.8925 134.2214 138.6740 153.6370 162.3293 182.9570 191.3420 223.3315 256.8375 277.0027 305.5457 311.7240 318.5692 332.0540 340.7364 355.3968 385.7324 414.8442 418.4162 424.2090 461.6871 464.8464 471.7332 493.7404 494.7543 578.1361 599.2049 678.8128 688.3864 742.3109 763.5866 768.9890 770.7209 822.7402 827.5066 827.7829 850.0956 851.8044 857.4903 859.7521 881.3207 896.3156 928.5243 931.1640 938.8973 962.3218 972.2250 974.2659 990.4324 1003.6168 1005.9315 1027.5732 1029.9732 1050.2693 1051.8183 1062.8753 1085.6912 1106.3376 1110.5169 1112.2690 1116.8906 1119.7637 1136.2583 1172.5202 1174.2335 1179.6383 1181.0646 1185.0146 1202.1613 1216.8696 1230.9451 1254.6979 1264.4829 1264.8584 1266.7755 1282.0255 1287.9473 1293.7315 1305.3825 1311.2752 1316.9059 1328.8702 1333.3512 1335.8557 1338.4008 1349.0016 1352.0036 1355.1183 1356.0664 1360.1254 1362.6019 1366.5749 1372.6035 1374.4278 1399.4830 1402.0228 1430.8390 1431.3397 1449.5547 1452.5753 1458.2949 1459.9906 1461.8314 1464.9775 1467.4336 1468.6619 1469.3226 1471.3357 1472.2021 1475.4152 1481.6713 1483.2725 1487.0341 1488.0303 1491.6961 1496.7862 1501.5812 2974.5595 2997.3208 2997.9815 2998.3567 3001.5341 3007.4334 3007.5991 3008.5456 3009.3748 3010.4400 3012.0969 3014.8348 3015.5703 3017.7961 3018.1625 3024.0679 3034.8369 3035.9559 3054.7061 3062.6513 3062.7087 3063.3339 3064.9933 3065.0898 3082.3649 3082.4330 3084.6536 3087.7052 3092.2543 3093.2141 3098.7064 3099.3682 3144.5143 3145.1093 3163.8482 3166.3218
redmass: 2.9390 3.4874 3.6975 2.5330 1.9936 3.1954 2.5415 2.2629 2.6241 2.7100 1.6044 1.3869 1.6695 2.8460 1.6967 1.4601 2.4491 2.9241 2.7155 1.8334 2.0014 2.7554 2.2122 2.4163 2.1037 2.1580 2.9869 2.9982 2.4446 2.0542 2.8727 1.9825 2.1168 3.6859 3.6262 1.0765 1.2224 1.6098 1.5512 1.6500 2.0287 1.9749 2.0339 2.0208 2.1932 2.5750 2.5487 2.3439 1.6270 1.5647 2.0255 2.3407 1.8967 1.9136 1.5491 2.2582 2.2803 3.5388 3.3255 2.1792 2.2322 2.6709 3.0532 1.4404 1.6475 1.6290 1.4466 1.3763 1.4801 1.9905 1.9092 1.4245 1.4106 1.7600 1.4464 1.4812 1.5594 1.2372 1.2676 1.2781 1.2378 1.1665 1.2084 1.2016 1.2121 1.0772 1.2422 1.2381 1.2740 1.2444 1.2960 1.3305 1.3505 1.3976 1.4082 1.4339 1.4059 1.3865 1.3378 1.3311 1.3191 1.3238 1.1523 1.1536 1.0825 1.0832 1.0717 1.0666 1.0683 1.0727 1.0734 1.0747 1.0838 1.0871 1.0698 1.0859 1.0866 1.0760 1.0699 1.0874 1.0799 1.0811 1.0592 1.0591 1.0685 1.0594 1.0686 1.0594 1.0626 1.0626 1.0614 1.0602 1.0588 1.0617 1.0597 1.0600 1.0603 1.0602 1.1008 1.0352 1.0349 1.1032 1.0996 1.1000 1.1048 1.0982 1.0981 1.1005 1.1001 1.1071 1.1069 1.1066 1.1062 1.1067 1.1065 1.1045 1.1045 1.1026 1.1023
irintensity: 0.2250 0.1958 0.0247 0.0418 0.0849 0.3544 0.9237 0.1178 0.0811 0.2725 0.2599 0.2281 0.2419 0.9138 0.2697 0.2321 0.0597 1.2876 0.0883 0.0166 0.2227 0.3890 0.0020 0.4415 0.0516 0.5236 0.0641 0.0917 0.0331 1.8227 0.7982 0.7345 4.0088 0.6373 10.8392 13.5222 0.4407 6.1713 1.7695 13.5620 1.9101 3.4522 8.2453 4.3475 75.5656 11.9104 1.7925 19.0215 22.4782 17.4162 11.7128 10.7059 10.8553 5.8590 1.5024 2.4594 11.3431 18.4428 4.8006 1.1448 0.7596 4.3154 0.7392 1.8955 0.1788 0.2768 0.0172 2.8877 0.4951 5.4490 1.4286 3.5131 3.6388 1.0459 0.3694 4.7878 1.7113 6.5752 2.8688 7.0714 17.6022 1.3435 3.0702 7.5737 1.8265 1.5373 0.5511 3.6198 1.2861 3.0494 0.1146 0.3723 2.4480 0.1336 1.4383 5.2733 1.5533 3.8083 3.9035 3.0104 6.8466 0.5479 17.8198 26.5849 3.6422 5.4772 1.1993 5.7603 16.0350 26.1859 13.2455 16.4026 38.2408 1.7124 21.9660 18.3116 0.9244 43.0406 56.8729 5.4648 7.2714 41.5929 21.1786 8.3192 10.3407 3.7964 8.2691 10.0479 11.9535 11.3040 8.7474 8.5024 11.9959 12.3329 8.8467 11.1711 22.0320 21.2609 2.8222 3.8630 3.9738 0.1707 5.7681 4.4946 6.9492 6.9050 18.3897 6.4753 21.5756 1.3839 13.9739 6.8906 37.2521 21.3270 20.4356 4.2028 4.1975 3.7428 3.5145
temp: 298.150 k
press: 1.00000 atm
elementType: 7 7 6 6 6 6 6 6 6 6 6 6 6 6 6 6 6 6 6 1 1 1 1 1 1 1 1 1 1 1 1 1 1 1 1 1 1 1 1 1 1 1 1 1 1 1 1 1 1 1 1 1 1 1 1
symmnumber: 1
zpe: 1355723.3 jmol-1
zpe.correction: 0.516368 hartree
zpe.thermalcorrener: 0.536633 hartree
zpe.thermalcorrenthalpy: 0.537578 hartree
zpe.thermalcorrgfe: 0.467914 hartree
zpe.sumelectzpe: -776.790362 hartree
zpe.sumelectthermal: -776.770096 hartree
zpe.sumelectthermalent: -776.769152 hartree
zpe.sumelectthermalfe: -776.838815 hartree
dipole: 0.0274 -0.6017 -0.0064
dipole: 0.6024
quadrupole: 87.2065 -101.8078 -100.7587
quadrupole: -0.4640 6.7903 -0.1100
quadrupole: 125.6598 -63.3544 -62.3054 -0.4640 6.7903 -0.1100
hfenergy: -777.3067294 hartree
pointgroup: C01 [X(C17H36N2)]
dipole: -0.0104812 -0.2355339 -0.0240095 debye
polarizability: 236.6196281|0.323297|163.6072324|-3.7017562|0.2286416|160.1778597 unknown
InChI: InChI=1S/C17H36N2/c1-18(12-6-3-7-13-18)16-10-5-11-17-19(2)14-8-4-9-15-19/h3-17H2,1-2H3
charge 2 multiplicity 1
55 atoms
N  -3.900006 -0.080457 -0.385019
N  3.889277 -0.104873 0.356063
C  -4.977199 -1.208155 -0.428812
C  -4.16174 0.817049 0.853483
C  4.966113 -1.233871 0.349612
C  4.204313 0.89943 -0.784432
C  -2.523458 -0.779795 -0.256398
C  2.522106 -0.788522 0.105114
C  -6.41868 -0.680941 -0.367615
C  -5.599902 1.357958 0.909618
C  6.407473 -0.705044 0.398206
C  5.642105 1.441191 -0.725689
C  -1.286124 0.137777 -0.177754
C  1.283165 0.129743 0.081061
C  -6.644099 0.221595 0.865997
C  6.684949 0.301947 -0.739742
C  0.000964 -0.729727 -0.099208
C  -3.952265 0.738851 -1.669308
C  3.883508 0.595868 1.709797
H  -4.767409 -1.8501 0.445613
H  -4.785129 -1.787154 -1.348987
H  -3.423608 1.635149 0.821289
H  -3.954108 0.179786 1.732704
H  4.796758 -1.798784 -0.5848
H  4.734713 -1.889122 1.207493
H  3.462253 1.711565 -0.713112
H  4.039465 0.343386 -1.725482
H  -2.58782 -1.40578 0.651809
H  -2.447383 -1.453601 -1.12978
H  2.418763 -1.549608 0.900506
H  2.621784 -1.3171 -0.860024
H  -7.079353 -1.566188 -0.322796
H  -6.691562 -0.15064 -1.298639
H  -5.778851 2.086187 0.096502
H  -5.691603 1.928806 1.851802
H  7.07203 -1.583562 0.305595
H  6.637131 -0.257588 1.382842
H  5.782627 2.089068 0.15975
H  5.775198 2.097186 -1.605357
H  -1.220323 0.794104 -1.065179
H  -1.33667 0.78683 0.716277
H  1.195773 0.702656 1.02285
H  1.350204 0.857226 -0.74906
H  -7.661692 0.645948 0.840672
H  -6.577695 -0.384742 1.790907
H  7.700122 0.719471 -0.633283
H  6.658057 -0.218709 -1.717241
H  0.088646 -1.339786 -1.020559
H  -0.083299 -1.440482 0.747622
H  -4.968778 1.121789 -1.82369
H  -3.256924 1.586894 -1.592624
H  -3.672047 0.09299 -2.516043
H  3.556793 -0.119821 2.480363
H  4.894159 0.950831 1.947873
H  3.20008 1.456272 1.677115
