program: Gaussian 09
title: 000115891
version: EM64L-G09RevD.01
frameworkgroup: C1[X(C7H5Cl3O3)]
method: RPBEPBE
basis: SDD
operation: Freq
keyword: #p
keyword: freq=noraman
keyword: PBEPBE/SDD
title: #p freq=noraman PBEPBE/SDD
converged: YES YES NO YES
title: Mulliken charges:
elementType: Cl Cl Cl O O O C C C C C C C H H H H H
charge: 0.101350 0.111138 0.111140 -0.261977 -0.194490 -0.223605 -0.086247 -0.626098 0.181893 0.224200 -0.319978 -0.248903 -0.142805 0.276226 0.276219 0.287585 0.263462 0.270889
chargesum: 0.00000
title: Mulliken charges with hydrogens summed into heavy atoms:
elementType: Cl Cl Cl O O O C C C C C C C
charge: 0.101350 0.111138 0.111140 -0.261977 -0.194490 -0.223605 0.466197 -0.626098 0.181893 0.224200 -0.032393 0.014559 0.128084
polarizability: 1.55122286e+02 -1.97537057e+01 1.13127604e+02 -5.70947335e-03 -5.19716577e-03 7.65128214e+01
1716.lowfreq: -14.7334 -9.4004 0.0018 0.0021 0.0025 1.9415 2.5238 30.7942 55.4718
frequency: -11.5478 30.7882 55.4683 73.9812 137.4716 140.3274 182.8623 205.0108 230.6557 239.7412 286.3503 330.8807 345.7676 413.3256 492.1807 527.5056 586.0133 591.8897 641.4639 697.3207 711.1192 759.1630 799.8620 845.0608 869.9264 887.5277 905.9154 931.9994 1011.7575 1022.6906 1048.2936 1061.7954 1110.2683 1146.0215 1213.4485 1220.0732 1260.3813 1355.7279 1369.3226 1441.4443 1454.3892 1539.2751 1663.8038 3021.6670 3090.1447 3229.7318 3248.2021 3270.1459
redmass: 7.8458 11.7178 9.0472 6.2325 7.4633 10.5501 17.0654 8.8612 13.1142 7.8255 14.7526 2.8232 19.1048 8.3803 8.3817 7.0990 4.8004 3.4542 5.1075 10.8426 7.2274 1.2446 11.2853 1.3287 6.7892 5.1167 1.3910 6.2828 1.8823 1.8034 3.0499 2.9492 5.2352 1.8550 1.5517 1.0725 6.3029 1.4320 2.6403 1.1029 4.5682 6.2773 11.7783 1.0565 1.1075 1.0918 1.0998 1.1089
irintensity: 2.9782 0.6713 1.7953 0.2684 2.1016 0.6585 0.2297 0.1283 2.2949 1.0869 6.2399 2.9976 1.7620 0.8551 15.3292 29.1437 11.6984 0.4552 130.9222 123.8427 19.0324 88.3368 51.6237 12.7107 6.8167 51.1352 0.8796 9.6148 128.6742 41.0222 59.4201 351.0094 36.0000 48.3540 5.0220 16.0772 146.6729 5.0400 6.5472 22.3154 93.6161 33.2234 282.6491 13.1588 2.0315 1.7001 1.2489 0.0013
temp: 298.150 k
press: 1.00000 atm
elementType: 17 17 17 8 8 8 6 6 6 6 6 6 6 1 1 1 1 1
symmnumber: 1
zpe: 285298.4 jmol-1
zpe.correction: 0.108664 hartree
zpe.thermalcorrener: 0.120782 hartree
zpe.thermalcorrenthalpy: 0.121726 hartree
zpe.thermalcorrgfe: 0.067919 hartree
zpe.sumelectzpe: -1874.592840 hartree
zpe.sumelectthermal: -1874.580723 hartree
zpe.sumelectthermalent: -1874.579779 hartree
zpe.sumelectthermalfe: -1874.633586 hartree
dipole: 2.2881 -2.1576 0.0003
dipole: 3.1449
quadrupole: -81.5034 -98.3893 -95.6072
quadrupole: -12.6025 -0.0004 0.0004
quadrupole: 10.3299 -6.5560 -3.7739 -12.6025 -0.0004 0.0004
hfenergy: -1874.7015045 hartree
pointgroup: C01 [X(C7H5Cl3O3)]
dipole: -0.9244033 -0.8224483 -0.0001218 debye
dipolederiv: -0.7041663 -0.3095183 -0.0000857 -0.2501021 -0.3413509 -0.0000545 -0.0000973 -0.0000609 -0.1544844 -0.1739616 -0.0241159 -0.0338038 -0.0054137 -0.3202424 -0.2928492 -0.0583028 -0.2610809 -0.5913744 -0.1739885 -0.0241847 0.0339096 -0.0055053 -0.3203788 0.2929061 0.0584099 0.2611387 -0.5912045 -1.9780269 0.15221 -0.0000032 0.5127464 -0.4684095 -0.0000582 -0.0001715 0.0000129 -0.2332262 -0.101767 0.0662352 0.0000124 0.0417483 -0.5829201 -0.0000891 0.0000536 -0.0000601 -0.1095556 -0.6984676 -0.1395476 0.000005 -0.0160654 -1.0418031 0.0000661 0.0000071 -0.0002253 -0.3025982 0.8985346 -0.0068288 0.0000543 0.2132124 -0.0140334 -0.0000029 0.000115 -0.000011 0.0683313 1.0905068 0.3401514 -0.0000233 0.245262 1.0566557 0.0000047 -0.0000107 0.000002 1.4231955 -0.5480837 -0.4245355 -0.0000194 -0.7149671 -0.1398488 0.0000778 -0.0000222 0.0000669 -0.0161972 2.3699167 0.2509639 -0.0000447 -0.1877665 1.4588718 -0.0000186 -0.0000535 0.0001312 0.2918162 0.3080963 0.05973 -0.0000587 0.2877195 0.0436519 -0.00002 0.0000031 0.0000352 -0.1147617 -0.3475787 0.0325831 0.0000127 0.252635 0.0123471 -0.0000053 0.0000737 0.000025 -0.1989407 -0.0383732 -0.0321457 -0.0000383 -0.2590797 0.3105755 0.0001004 -0.0000344 0.0000703 -0.0850571 -0.048064 0.0265863 0.0242908 -0.068343 0.0575538 -0.0645236 -0.0375196 -0.0461288 0.0116443 -0.0480722 0.0265729 -0.0242835 -0.0683704 0.0575211 0.0645293 0.0374948 0.0461529 0.0116676 0.0798236 0.0583208 0.0000324 0.073648 0.1064451 -0.0000192 0.0000366 -0.0000249 0.1785044 0.0694073 -0.0689419 0.0000083 -0.0787633 0.0309761 -0.0000135 0.0000014 -0.0000145 0.1991388 0.0442643 0.0164647 0.0000351 0.0274051 0.0943887 -0.0000305 0.0000166 -0.0000286 0.2131018 unknown
polarizability: 156.2309018|18.5046995|112.0189889|-0.0055565|0.0053604|76.5128214 unknown
InChI: InChI=1S/C7H5Cl3O3/c8-7(9,10)4-13-6(11)5-2-1-3-12-5/h1-3H,4H2
charge 0 multiplicity 1
18 atoms
Cl 4.547006 0.685959 0.000363
Cl 2.837104 -1.306656 -1.515295
Cl 2.836736 -1.307036 1.51511
O  0.528906 0.100838 -0.000211
O  -3.051801 0.819802 0.000269
O  -0.515618 2.202025 0.000162
C  1.815003 0.810539 0.000044
C  2.922691 -0.239448 0.000051
C  -1.81528 0.138323 -0.00011
C  -0.604447 0.954422 -0.000251
C  -2.038215 -1.237178 -0.000243
C  -3.464594 -1.431747 -0.000034
C  -4.040376 -0.166592 0.000314
H  1.903476 1.447144 0.898697
H  1.9037 1.447366 -0.89843
H  -1.261383 -1.997968 -0.00051
H  -3.996587 -2.380447 -0.000102
H  -5.064221 0.197254 0.000575
