program: Gaussian 09
title: 000115890
version: EM64L-G09RevD.01
frameworkgroup: C1[X(C7H5Br3O3)]
method: RPBEPBE
basis: SDD
operation: Freq
keyword: #p
keyword: freq=noraman
keyword: PBEPBE/SDD
title: #p freq=noraman PBEPBE/SDD
converged: NO YES NO NO
title: Mulliken charges:
elementType: Br Br Br O O O C C C C C C C H H H H H
charge: 0.148588 0.151084 0.151063 -0.261852 -0.194867 -0.222370 -0.129041 -0.751368 0.179463 0.229440 -0.302554 -0.254700 -0.142910 0.290671 0.290758 0.284453 0.263426 0.270715
chargesum: 0.00000
title: Mulliken charges with hydrogens summed into heavy atoms:
elementType: Br Br Br O O O C C C C C C C
charge: 0.148588 0.151084 0.151063 -0.261852 -0.194867 -0.222370 0.452388 -0.751368 0.179463 0.229440 -0.018101 0.008726 0.127805
polarizability: 1.77595922e+02 -2.44131392e+01 1.31963298e+02 1.05900175e-01 4.50093501e-03 1.02024772e+02
1716.lowfreq: -11.7310 -0.6322 -0.0008 -0.0005 -0.0003 4.3059 7.6064 25.4591 45.0198
frequency: -10.7790 25.4339 45.0151 71.3406 107.9020 123.1205 147.0226 151.3257 160.9124 205.3899 223.1820 249.5348 292.1974 397.4689 451.5649 488.0584 566.9561 585.8852 591.3291 647.1693 710.0693 758.7453 785.1416 844.7071 869.8369 886.3724 904.9632 924.0238 1008.3179 1009.8851 1046.1651 1059.0926 1079.0508 1145.5772 1213.3515 1215.5119 1258.6848 1349.3900 1369.3081 1434.4042 1454.6616 1539.8135 1663.4198 3016.2494 3085.7443 3229.6263 3247.3061 3270.5294
redmass: 8.9060 10.7091 11.0544 6.1213 12.1694 12.4865 15.2570 14.6265 27.1212 8.1056 42.8459 9.3206 2.3065 8.3403 6.2414 8.1738 4.9631 5.0399 3.3598 10.6767 7.2093 1.2451 11.4715 1.3290 6.8059 5.1711 1.3885 6.6833 1.9796 1.7343 3.0034 2.7052 5.9510 1.8308 1.5527 1.0630 5.9052 1.3935 2.6400 1.0812 5.0003 6.2780 11.7567 1.0559 1.1075 1.0918 1.0999 1.1088
irintensity: 2.4238 1.0932 1.0120 0.2558 0.6462 0.8046 0.6541 0.2560 0.0911 0.4439 0.1199 9.3207 5.8990 2.5390 26.0272 15.4050 121.5512 21.2286 0.0901 132.6989 15.8737 85.8056 29.0110 11.6231 6.8263 48.0633 0.5183 4.8466 163.8241 47.1306 89.7249 305.3634 74.7113 47.2581 4.6745 16.7825 156.4831 8.2215 6.3047 16.4930 101.6867 36.1955 269.5554 12.2255 1.0506 1.7021 0.9509 0.0056
temp: 298.150 k
press: 1.00000 atm
elementType: 35 35 35 8 8 8 6 6 6 6 6 6 6 1 1 1 1 1
symmnumber: 1
zpe: 280588.6 jmol-1
zpe.correction: 0.106871 hartree
zpe.thermalcorrener: 0.119831 hartree
zpe.thermalcorrenthalpy: 0.120775 hartree
zpe.thermalcorrgfe: 0.063222 hartree
zpe.sumelectzpe: -534.788639 hartree
zpe.sumelectthermal: -534.775679 hartree
zpe.sumelectthermalent: -534.774734 hartree
zpe.sumelectthermalfe: -534.832288 hartree
dipole: 2.0316 -2.3386 0.0005
dipole: 3.0979
quadrupole: -84.2970 -106.3960 -102.3050
quadrupole: -14.1708 0.0250 0.0015
quadrupole: 13.3690 -8.7300 -4.6390 -14.1708 0.0250 0.0015
hfenergy: -534.8955096 hartree
pointgroup: C01 [X(C7H5Br3O3)]
dipole: -0.8234382 -0.8985535 0.0003204 debye
dipolederiv: -0.7067767 -0.362171 0.0006174 -0.3449316 -0.3374545 0.0004399 0.0008081 0.0004715 -0.083902 -0.0869548 -0.0527308 -0.0744861 -0.0197185 -0.2747125 -0.3324484 -0.0825953 -0.314865 -0.6197973 -0.0864563 -0.0519139 0.0728899 -0.0187512 -0.2749611 0.3327157 0.0810071 0.3151729 -0.6201083 -2.1032594 0.2007306 0.0006293 0.5433722 -0.4619182 0.0002314 0.0031311 -0.0005417 -0.2128318 -0.1076666 0.0618625 -0.0001122 0.038173 -0.5767303 0.0002658 -0.0005092 0.0000283 -0.107362 -0.7043251 -0.1242358 -0.0001764 0.0209715 -1.0387815 -0.0016981 -0.0000392 0.0015632 -0.2936088 0.9797206 -0.0819393 -0.0009255 0.1561746 -0.0529743 -0.0000136 -0.0013329 0.0002041 -0.0297423 0.924108 0.4859635 0.0011353 0.4221174 0.9970062 -0.0009062 0.0008759 -0.0008864 1.4841671 -0.5574135 -0.4112703 -0.0002166 -0.7183437 -0.1285416 -0.0008765 -0.000646 -0.0007621 -0.0217268 2.4417583 0.1979244 0.0003767 -0.2554369 1.4533838 0.0017678 -0.0001541 -0.0000392 0.2809235 0.3110838 0.0516537 0.0006603 0.2889318 0.0387551 0.0004028 0.0003439 -0.0001417 -0.105039 -0.3514352 0.0365451 -0.0000256 0.2560119 0.0088442 0.0003319 -0.0003709 0.0000698 -0.1998944 -0.0460393 -0.0281062 0.0003813 -0.2581298 0.3136209 -0.0004264 0.0000489 -0.0002578 -0.0852405 -0.0497149 0.0330136 0.0364526 -0.068516 0.0538295 -0.0688392 -0.0374527 -0.0394923 0.0168361 -0.0496068 0.033217 -0.0364275 -0.0683116 0.0538941 0.0689194 0.0375676 0.039303 0.0169502 0.0814528 0.0619824 -0.0002738 0.0787419 0.1013134 0.0000824 -0.0003236 0.0001192 0.1708368 0.0683834 -0.0672847 -0.0001769 -0.0796304 0.0311991 -0.0000941 -0.0001268 -0.0000711 0.19753 0.0431417 0.0167591 -0.0003223 0.0272752 0.0942277 0.0001451 -0.0002319 0.0001252 0.2120096 unknown
polarizability: 178.8591999|23.1681251|130.7000418|0.0829796|-0.0226447|102.0247497 unknown
InChI: InChI=1S/C7H5Br3O3/c8-7(9,10)4-13-6(11)5-2-1-3-12-5/h1-3H,4H2
charge 0 multiplicity 1
18 atoms
Br 4.671393 0.769233 -0.003317
Br 2.81286 -1.395694 -1.646395
Br 2.817545 -1.396271 1.644275
O  0.519015 0.105705 0.002719
O  -3.059686 0.835357 -0.000957
O  -0.521653 2.209929 0.001478
C  1.810648 0.809108 0.000777
C  2.921069 -0.247194 -0.001005
C  -1.825336 0.1494 0.002031
C  -0.61197 0.962564 0.004458
C  -2.052799 -1.225165 0.001703
C  -3.479568 -1.415421 -0.000975
C  -4.051221 -0.148612 -0.002543
H  1.898454 1.445285 0.900021
H  1.895758 1.445446 -0.89861
H  -1.277852 -1.98817 0.00349
H  -4.014296 -2.362563 -0.001694
H  -5.073761 0.218664 -0.004656
