program: Gaussian 09
title: 000115881
version: EM64L-G09RevD.01
frameworkgroup: C1[X(C8H7Cl3O3)]
method: RPBEPBE
basis: SDD
operation: Freq
keyword: #p
keyword: freq=noraman
keyword: PBEPBE/SDD
title: #p freq=noraman PBEPBE/SDD
converged: YES YES NO NO
title: Mulliken charges:
elementType: Cl Cl Cl O O O C C C C C C C C H H H H H H H
charge: 0.028638 0.003822 0.003828 -0.228043 -0.193545 -0.242797 0.037345 -0.591782 -0.592272 0.270707 0.180912 -0.307435 -0.247020 -0.140391 0.305811 0.290393 0.290198 0.306207 0.290045 0.264299 0.271079
chargesum: 0.00000
title: Mulliken charges with hydrogens summed into heavy atoms:
elementType: Cl Cl Cl O O O C C C C C C C C
charge: 0.028638 0.003822 0.003828 -0.228043 -0.193545 -0.242797 0.037345 0.004423 0.004134 0.270707 0.180912 -0.017390 0.017279 0.130688
polarizability: 1.55921334e+02 1.66093488e-02 9.89699374e+01 6.36901348e+00 -3.56125365e-02 1.14097179e+02
1716.lowfreq: -6.0538 -0.0022 0.0007 0.0010 2.1562 7.9859 26.1277 43.7981 65.6410
frequency: 26.0800 43.7916 65.6398 77.7331 84.6935 105.9833 130.1397 172.0593 215.2950 219.8166 239.7862 272.7913 299.8697 317.7051 406.5995 488.6255 555.7184 584.8586 585.0576 591.5096 669.3795 710.0195 735.9702 761.5631 763.8632 794.2413 848.4735 870.4568 886.8494 894.1094 911.1458 986.1862 999.5447 1041.2223 1057.8353 1061.2623 1073.5833 1146.1877 1152.1781 1215.0727 1235.6279 1272.2497 1292.2764 1311.7599 1371.2713 1419.6462 1430.8696 1452.3560 1537.5880 1664.6015 3058.3695 3064.7822 3143.5820 3149.0274 3231.0650 3249.6841 3270.1505
redmass: 11.5176 6.3278 12.4663 6.5466 8.3013 13.0519 9.0316 7.5466 5.7537 7.9881 6.9420 10.9925 3.3651 5.3225 4.6011 8.1292 7.0154 4.3225 4.7167 3.5338 7.7510 7.2434 10.3518 1.2448 6.1980 4.5892 1.3279 6.8169 4.9066 1.4844 1.3897 2.7191 1.6822 2.1984 2.5167 4.1030 9.7096 1.8298 1.0214 1.5701 1.5311 3.5986 1.2868 1.2080 2.6485 1.0848 1.1005 5.2070 6.1829 10.9576 1.0558 1.0563 1.1105 1.1103 1.0918 1.0997 1.1091
irintensity: 2.2530 2.6559 2.1010 0.3777 3.2050 0.3153 0.3761 0.1936 0.1958 9.3146 0.4690 5.3631 0.1257 1.7902 4.0551 9.0169 26.6907 43.7080 26.1648 1.4847 25.0772 20.6772 9.1631 84.2441 1.0943 15.1636 11.3742 7.8960 58.8442 0.0013 1.0870 435.1234 7.1404 62.3816 75.6441 0.2497 162.3343 34.3599 0.0004 3.1721 160.9047 18.6985 0.5213 15.2869 6.3845 8.2679 75.5265 107.3233 26.3749 311.6649 2.7103 14.4341 0.3059 1.6573 1.4726 1.8914 0.0059
temp: 298.150 k
press: 1.00000 atm
elementType: 17 17 17 8 8 8 6 6 6 6 6 6 6 6 1 1 1 1 1 1 1
symmnumber: 1
zpe: 360182.5 jmol-1
zpe.correction: 0.137186 hartree
zpe.thermalcorrener: 0.151388 hartree
zpe.thermalcorrenthalpy: 0.152332 hartree
zpe.thermalcorrgfe: 0.093253 hartree
zpe.sumelectzpe: -1913.823718 hartree
zpe.sumelectthermal: -1913.809517 hartree
zpe.sumelectthermalent: -1913.808572 hartree
zpe.sumelectthermalfe: -1913.867651 hartree
dipole: 1.4610 -0.0024 0.0427
dipole: 1.4616
quadrupole: -77.5290 -111.2026 -101.5760
quadrupole: -0.0200 14.0039 -0.0305
quadrupole: 19.2402 -14.4334 -4.8068 -0.0200 14.0039 -0.0305
hfenergy: -1913.9609043 hartree
pointgroup: C01 [X(C8H7Cl3O3)]
dipole: 0.5746584 0.000073 -0.02117 debye
dipolederiv: -0.3285963 0.0083099 0.1824675 0.0120654 -0.1571444 -0.0157863 0.2563123 -0.0154448 -0.4866039 -0.1465957 0.0799625 -0.026852 0.0237307 -0.4663653 0.0449235 -0.0308403 0.1150863 -0.1289058 -0.1461059 -0.0808652 -0.0190683 -0.0253557 -0.4790766 -0.0111329 -0.0280562 -0.08153 -0.1166281 -1.9894168 0.0155266 0.4093514 0.0284089 -0.3566907 -0.0108463 0.6726935 -0.0100174 -0.6012754 -0.0785851 -0.0010669 -0.0235388 -0.003469 -0.106217 -0.0225188 -0.0630421 -0.0222829 -0.587056 -0.8144652 -0.0110665 -0.2109614 -0.0103095 -0.3326246 -0.0322844 -0.2070346 -0.0325206 -0.9884998 1.5170382 -0.0187792 -0.4555155 -0.0114884 0.3880588 0.0139534 -0.2759637 0.0139253 0.6889212 -0.0436324 -0.0904301 0.083706 -0.100003 0.4401779 -0.1321844 0.0703073 -0.1521208 0.0036174 -0.0447479 0.0954978 0.0755718 0.104556 0.4638374 0.0880308 0.0599553 0.1081165 -0.0205098 2.4766305 0.0137521 0.1661984 -0.0066058 0.3284861 0.0534665 -0.2648521 0.0525332 1.4187136 -0.8202681 -0.0181366 -0.3337624 -0.033078 -0.0164007 0.0005633 -0.6528953 -0.0007618 0.0266882 0.3927634 0.0021715 0.0046989 0.0154149 -0.0975011 0.0050171 0.2770214 0.0058146 0.0073031 -0.311422 0.003947 0.0922445 0.0145821 -0.1954195 0.0072645 0.3315932 0.0081566 -0.0464161 -0.082504 0.0019672 0.0350824 -0.0094303 -0.0779552 0.0200279 -0.2101923 0.0191339 0.3547757 0.1787555 0.049643 0.0371017 0.0777759 0.0227556 0.0326526 0.0287066 0.0348546 0.0017133 -0.0719129 0.026805 -0.03565 0.001363 0.0248689 0.0422185 -0.0138006 0.0397595 0.1095765 -0.0720534 -0.0303913 -0.0335323 -0.0028724 0.0178126 -0.0337834 -0.0140458 -0.0311822 0.1166646 0.1802896 -0.04562 0.0420177 -0.0747964 0.0159559 -0.033801 0.0362785 -0.0357723 0.009281 0.1059749 0.0022163 0.0563044 0.0029293 0.1766993 -0.0036871 0.0718186 -0.0036459 0.0919402 0.0423398 -0.0038572 -0.0697702 -0.0043447 0.1972298 -0.00656 -0.0779464 -0.0065761 0.0614844 0.0565139 0.0004141 0.0239062 0.000927 0.2095129 -0.0055335 0.0339825 -0.0055257 0.0852156 unknown
polarizability: 156.576775|0.3916328|99.0020509|3.5470003|0.6724104|113.4096244 unknown
InChI: InChI=1S/C8H7Cl3O3/c9-4-8(11,5-10)14-7(12)6-2-1-3-13-6/h1-3H,4-5H2
charge 0 multiplicity 1
21 atoms
Cl -2.876403 0.087153 1.78737
Cl -1.898761 -2.824737 0.259705
Cl -1.908393 2.839584 -0.01373
O  -0.621819 0.024027 0.419531
O  2.751907 -0.029478 -0.966079
O  0.012876 -0.084212 -1.856842
C  -2.049124 0.005908 0.097618
C  -2.491773 -1.286381 -0.613152
C  -2.492992 1.221886 -0.736086
C  0.323951 -0.024908 -0.645861
C  1.661572 0.00713 -0.069134
C  2.132596 0.069303 1.241059
C  3.569261 0.072251 1.170272
C  3.902968 0.011765 -0.178418
H  -2.058186 -1.326898 -1.623413
H  -3.589229 -1.347562 -0.640326
H  -3.59041 1.276681 -0.773978
H  -2.054371 1.16545 -1.74352
H  1.506493 0.107307 2.129257
H  4.266567 0.113557 2.003908
H  4.843172 -0.008927 -0.722781
