program: Gaussian 09
title: 000115878
version: EM64L-G09RevD.01
frameworkgroup: C1[X(C11H16N2O2)]
method: RPBEPBE
basis: SDD
operation: Freq
keyword: #p
keyword: freq=noraman
keyword: PBEPBE/SDD
title: #p freq=noraman PBEPBE/SDD
converged: YES YES NO NO
title: Mulliken charges:
elementType: O O N N C C C C C C C C C C C H H H H H H H H H H H H H H H H
charge: -0.414838 -0.273228 -0.003345 -0.382251 -0.401988 -0.394890 -0.384753 -0.372665 -0.389325 0.331709 -0.662610 -0.028785 0.574669 -0.149558 -0.734645 0.220729 0.188915 0.197705 0.229406 0.221941 0.197485 0.176271 0.244141 0.239818 0.168581 0.261763 0.246929 0.237189 0.223588 0.261499 0.370544
chargesum: 0.00000
title: Mulliken charges with hydrogens summed into heavy atoms:
elementType: O O N N C C C C C C C C C C C
charge: -0.044294 -0.273228 -0.003345 -0.120489 0.007656 0.032221 0.034673 0.047747 0.019074 0.331709 -0.178491 -0.028785 0.574669 -0.149558 -0.249558
polarizability: 2.32985994e+02 -3.12287129e+00 1.41775373e+02 -2.95959998e+00 -5.92398091e+00 9.24952306e+01
1716.lowfreq: -25.3650 -16.8745 -6.6246 0.0002 0.0003 0.0004 9.9269 30.2944 45.9803
frequency: -18.9507 29.4609 45.7216 110.7478 121.0862 151.5344 218.6120 227.3212 258.0566 273.7575 275.1560 298.4818 349.1099 367.5728 420.6693 437.3434 448.9588 504.0069 524.2649 539.6656 540.2892 574.0268 591.9487 649.2577 662.3537 687.4662 766.5726 777.5608 798.7427 850.0937 857.9564 907.6506 911.9997 945.1843 958.4370 975.9471 980.3589 1002.9084 1043.1416 1072.4201 1084.7836 1098.6783 1115.1804 1140.2395 1148.1954 1154.1443 1194.5126 1227.7556 1236.2399 1258.7671 1263.6723 1274.8911 1279.5853 1326.7528 1338.8978 1345.8146 1348.1985 1352.1430 1361.9116 1371.3850 1418.7766 1450.0272 1450.3701 1458.2097 1461.5921 1464.8279 1475.6676 1515.5096 1561.4636 1664.4396 1710.5711 2822.3005 2851.0002 2966.2478 2968.1171 2995.6125 2997.9177 3011.3626 3040.7961 3054.2479 3058.8981 3062.0395 3067.5334 3094.7174 3202.8097 3340.1247 3379.3055
redmass: 3.3952 4.5984 4.3636 3.4030 6.2436 3.2844 1.8567 3.4201 5.4110 3.3912 3.1276 2.8938 2.6156 1.7626 4.4037 2.6554 3.0963 2.1823 2.4415 2.2079 4.0556 1.3308 2.6955 1.5680 4.4254 6.1932 3.8611 2.3496 1.4563 2.8681 1.3906 2.2749 2.1644 1.4240 1.3190 2.6754 1.7550 2.6210 2.0735 1.5887 2.5154 3.6665 2.5116 1.1087 1.3395 2.2863 3.2144 1.6574 2.0409 1.3038 1.2267 1.5450 1.7896 1.2782 1.4345 1.4954 1.5573 2.1829 1.4970 2.1784 1.2048 1.0875 1.0876 1.0915 1.0861 1.0989 1.1126 1.7407 11.0655 6.4162 7.9612 1.0708 1.0700 1.0587 1.0641 1.0613 1.0607 1.1009 1.0958 1.0917 1.0992 1.0935 1.1005 1.0611 1.1152 1.0751 1.0636
irintensity: 0.0745 0.3513 1.8312 0.0161 1.5569 0.4101 2.4765 0.3750 21.1760 3.8175 2.3492 2.8492 7.4701 1.6962 0.3268 10.7314 0.2805 113.9464 2.3783 23.8795 2.9339 150.8690 1.4486 6.8963 1.6062 11.3536 15.1453 11.0518 0.4558 10.7779 4.4100 11.8741 10.0919 34.0865 5.5768 22.5329 35.5829 8.4995 17.7778 9.4637 7.4601 147.6758 3.5183 1.6415 4.5189 13.0043 17.1932 20.5551 4.6291 1.1731 12.4993 4.4621 24.8678 3.6842 4.4694 4.7914 22.6749 115.6310 18.2105 83.8419 12.5973 4.0848 8.6616 8.6889 12.6398 9.1456 8.5990 93.5304 486.5721 73.8289 269.4071 91.7853 127.0459 39.1433 46.2173 30.3593 31.2766 15.9844 64.7305 51.3554 3.6177 14.7139 66.7798 5.0876 4.8505 101.4598 27.4531
temp: 298.150 k
press: 1.00000 atm
elementType: 8 8 7 7 6 6 6 6 6 6 6 6 6 6 6 1 1 1 1 1 1 1 1 1 1 1 1 1 1 1 1
symmnumber: 1
zpe: 673629.6 jmol-1
zpe.correction: 0.256572 hartree
zpe.thermalcorrener: 0.270209 hartree
zpe.thermalcorrenthalpy: 0.271153 hartree
zpe.thermalcorrgfe: 0.215966 hartree
zpe.sumelectzpe: -687.515624 hartree
zpe.sumelectthermal: -687.501987 hartree
zpe.sumelectthermalent: -687.501043 hartree
zpe.sumelectthermalfe: -687.556230 hartree
dipole: 4.3364 -4.9485 1.4151
dipole: 6.7301
quadrupole: -92.4811 -85.9599 -89.6148
quadrupole: 10.1785 -1.6586 -0.1609
quadrupole: -3.1291 3.3920 -0.2629 10.1785 -1.6586 -0.1609
hfenergy: -687.7721959 hartree
pointgroup: C01 [X(C11H16N2O2)]
dipole: -1.733357 -1.8906083 -0.6573344 debye
polarizability: 233.0326589|0.1316882|141.5626719|3.987458|6.4479756|92.6612667 unknown
InChI: InChI=1S/C11H16N2O2/c1-8-7-9(11(15)10(8)14)12-13-5-3-2-4-6-13/h12,15H,1-7H2
charge 0 multiplicity 1
31 atoms
O  0.528001 1.795281 0.37835
O  3.372599 1.768242 0.414652
N  -1.606939 -0.36383 -0.078053
N  -0.446973 -1.183998 -0.158292
C  -4.382999 0.449498 -0.471253
C  -3.221778 1.103881 -1.254342
C  -3.873491 -0.089211 0.885701
C  -2.049895 0.116667 -1.420794
C  -2.679754 -1.046691 0.688687
C  0.82275 -0.667511 -0.059985
C  2.016258 -1.609948 -0.222258
C  1.259795 0.627105 0.18955
C  3.228052 -0.697116 -0.037523
C  2.718163 0.684512 0.214036
C  4.540137 -1.038359 -0.086926
H  -5.199402 1.178076 -0.311573
H  -4.806971 -0.385791 -1.067016
H  -3.559331 1.438557 -2.253362
H  -2.853359 1.991605 -0.707158
H  -3.542633 0.755827 1.518279
H  -4.678211 -0.621445 1.427556
H  -2.365036 -0.742456 -2.068356
H  -1.188466 0.614544 -1.897235
H  -2.258942 -1.353279 1.661682
H  -3.030399 -1.9715 0.155439
H  -0.555441 -2.145919 -0.519133
H  1.992663 -2.416819 0.537164
H  2.020951 -2.094598 -1.21966
H  4.877174 -2.063696 -0.276053
H  5.303851 -0.267721 0.067649
H  1.214627 2.511691 0.520328
