program: Gaussian 09
title: 000115876
version: EM64L-G09RevD.01
frameworkgroup: C1[X(C16H20ClN3O)]
method: RPBEPBE
basis: SDD
operation: Freq
keyword: #p
keyword: freq=noraman
keyword: PBEPBE/SDD
title: #p freq=noraman PBEPBE/SDD
converged: YES YES NO NO
title: Mulliken charges:
elementType: Cl O N N N C C C C C C C C C C C C C C C C H H H H H H H H H H H H H H H H H H H H
charge: -0.055894 -0.371500 -0.084466 -0.097573 -0.176586 -0.365739 -0.351807 -0.438172 -0.447700 -0.352390 -0.414735 -0.455680 0.099403 0.183150 0.317258 -0.272113 -0.362778 -0.243035 -0.362801 -0.251703 -0.078658 0.222198 0.172139 0.175641 0.218022 0.225081 0.202987 0.204636 0.222496 0.206802 0.194333 0.198722 0.215051 0.217569 0.191917 0.246807 0.291686 0.263765 0.282748 0.258242 0.372672
chargesum: 0.00000
title: Mulliken charges with hydrogens summed into heavy atoms:
elementType: Cl O N N N C C C C C C C C C C C C C C C C
charge: -0.055894 0.001173 -0.084466 -0.097573 -0.176586 0.028598 0.041857 -0.010104 -0.020569 0.048745 -0.000961 -0.046194 0.099403 0.183150 0.317258 -0.025306 -0.071092 0.020730 -0.080054 0.006539 -0.078658
polarizability: 3.10007046e+02 -1.88787884e+01 2.33916310e+02 -2.04174600e+01 -5.31651587e+00 1.28105960e+02
1716.lowfreq: -14.4470 -5.8143 -0.0009 0.0002 0.0006 2.6519 10.8726 14.4948 22.5353
frequency: 5.8031 13.8205 22.2131 31.0275 64.1402 77.5773 88.8616 114.0448 115.7907 129.8197 169.1700 180.1464 211.7072 224.0711 236.4365 288.5688 306.5434 321.5403 329.4675 335.2592 365.7770 395.1576 405.5700 406.7569 475.6485 498.4088 504.4175 560.9620 568.4294 611.1280 632.0081 646.0865 647.1327 696.2876 726.1658 743.5675 749.1411 781.1872 802.5419 830.7066 837.9963 847.0007 852.1881 864.2427 879.2125 897.1264 906.1617 920.7406 961.7684 967.8764 986.9625 994.0056 1030.0414 1059.3118 1064.7880 1070.9890 1083.2877 1091.6127 1100.0643 1125.3513 1130.8807 1139.4325 1144.4749 1181.5550 1187.7173 1188.9862 1207.6853 1227.7572 1231.8032 1242.0735 1242.8698 1279.0207 1287.3708 1292.1163 1299.0594 1310.4197 1327.7383 1331.7538 1332.8884 1347.4496 1350.7555 1381.5950 1382.3063 1394.2352 1439.4560 1447.5345 1455.3514 1462.8959 1463.2442 1471.2229 1477.8589 1479.1498 1494.8891 1548.2749 1556.5497 1602.5868 1623.1743 2825.4966 2838.3374 2863.5125 2892.0930 2944.9715 2990.3738 2996.4930 3007.5985 3019.9280 3032.1010 3045.8455 3058.3699 3063.2841 3088.5214 3156.7758 3173.0690 3178.2486 3189.2985 3195.2455 3438.8110
redmass: 3.7139 3.7903 1.9244 3.1644 5.0849 3.9969 5.4005 4.1786 4.3203 2.9137 4.7585 6.1350 2.7884 5.4101 2.5327 5.9513 2.2255 4.9088 2.2455 1.6037 3.3881 4.5131 3.3436 4.7218 3.3343 5.7165 5.5948 5.3889 5.7916 3.0490 2.9036 4.2154 3.1689 6.8811 2.3331 2.6001 1.4586 2.0006 1.7288 6.3220 1.4931 1.7145 1.9123 1.4342 2.5713 2.6584 2.4326 1.2842 2.0225 1.5905 1.3325 4.1347 3.1845 2.7598 2.6805 2.0945 2.3689 1.5881 2.4457 2.0565 1.9154 1.6091 2.0939 1.2399 1.5910 1.4094 1.3490 1.6557 1.3205 1.3206 1.4669 1.1918 1.2569 1.2605 2.2834 1.2619 2.5400 1.4382 1.2884 1.4350 1.4306 4.6239 1.7592 2.0247 1.4708 2.4243 1.0952 3.1328 1.0877 1.0879 1.0782 1.0923 1.1048 7.6258 8.5844 7.4406 7.2936 1.0713 1.0718 1.0679 1.0576 1.0986 1.0869 1.0627 1.0593 1.0667 1.0844 1.0889 1.1026 1.1040 1.1053 1.0889 1.0868 1.0965 1.0924 1.0988 1.0686
irintensity: 0.6316 0.3206 0.0277 0.1663 0.2680 0.5332 0.5565 1.5394 5.1703 0.4789 4.3787 0.2509 2.3436 2.6768 2.6784 2.1860 49.2503 17.4760 14.6674 53.8592 0.1744 3.3013 16.1900 16.7808 4.3122 0.0728 9.9952 5.5275 5.9120 4.0216 0.2090 12.0087 3.2442 7.9893 11.3364 2.7374 0.0694 58.7363 4.2720 50.8773 22.2046 6.0227 11.7617 30.9754 1.4776 3.7587 6.9945 0.7429 2.4554 1.2262 1.0479 44.8174 1.0953 1.9434 9.0289 8.5566 17.6179 0.3744 9.2549 14.6060 9.1457 7.6150 59.0539 6.6269 31.2364 18.8768 4.7789 17.7175 7.7777 5.5496 1.5198 5.3548 5.5279 2.0795 2.2459 3.4908 4.9640 1.3642 34.6011 7.7641 132.6231 44.7216 5.4499 41.9480 62.7121 83.6908 9.7997 38.7861 3.0743 7.4384 0.7423 11.5619 7.9618 60.0288 2.8383 165.3313 201.1614 65.6445 81.8626 155.7236 64.5747 36.0593 20.9074 60.2036 21.3106 76.2187 70.7384 22.6922 51.9446 5.5613 76.2975 1.5109 0.8590 3.0998 0.3634 4.1388 15.5825
temp: 298.150 k
press: 1.00000 atm
elementType: 17 8 7 7 7 6 6 6 6 6 6 6 6 6 6 6 6 6 6 6 6 1 1 1 1 1 1 1 1 1 1 1 1 1 1 1 1 1 1 1 1
symmnumber: 1
zpe: 872175.3 jmol-1
zpe.correction: 0.332194 hartree
zpe.thermalcorrener: 0.352616 hartree
zpe.thermalcorrenthalpy: 0.353560 hartree
zpe.thermalcorrgfe: 0.277886 hartree
zpe.sumelectzpe: -1319.596299 hartree
zpe.sumelectthermal: -1319.575877 hartree
zpe.sumelectthermalent: -1319.574933 hartree
zpe.sumelectthermalfe: -1319.650607 hartree
dipole: -1.6894 -2.5680 2.2062
dipole: 3.7836
quadrupole: -131.9311 -122.4833 -130.5448
quadrupole: 16.1872 -10.3112 -5.2790
quadrupole: -3.6114 5.8364 -2.2251 16.1872 -10.3112 -5.2790
hfenergy: -1319.9284935 hartree
pointgroup: C01 [X(C16H20Cl1N3O1)]
dipole: 0.6975076 -0.932979 -0.9267915 debye
polarizability: 308.1750091|22.9731044|234.6389501|-20.4789492|10.4224625|129.2153565 unknown
InChI: InChI=1S/C16H20ClN3O/c17-13-4-5-14-15(6-11-20(21)16(14)12-13)18-7-3-10-19-8-1-2-9-19/h4-6,11-12,21H,1-3,7-10H2
charge 0 multiplicity 1
41 atoms
Cl 4.848784 3.526636 0.134029
O  5.025567 -1.789997 -0.66256
N  -4.670767 -0.090789 -0.194406
N  -0.402179 -0.884289 0.475893
N  3.614887 -1.520973 -0.512089
C  -5.242382 0.583659 -1.389379
C  -4.842698 0.896062 0.904567
C  -6.540941 1.241447 -0.857122
C  -6.266941 1.466913 0.669931
C  -3.290057 -0.583877 -0.389813
C  -2.792383 -1.446145 0.785572
C  -1.375685 -1.998365 0.538797
C  0.864342 -1.145912 0.195361
C  1.830594 -0.008995 0.154617
C  3.209961 -0.214872 -0.171363
C  1.449497 -2.469854 -0.067872
C  1.412719 1.312706 0.451325
C  2.7789 -2.621863 -0.388872
C  4.139326 0.856882 -0.172417
C  2.310026 2.395874 0.439367
C  3.664627 2.1401 0.130858
H  -5.423487 -0.146794 -2.198546
H  -4.549028 1.370945 -1.787412
H  -4.077867 1.714068 0.836122
H  -4.733139 0.41544 1.891869
H  -7.400881 0.563916 -0.995517
H  -6.764715 2.182594 -1.389655
H  -6.322922 2.532286 0.955184
H  -7.007396 0.918447 1.276934
H  -2.566026 0.256234 -0.546281
H  -3.280265 -1.198812 -1.312885
H  -3.500964 -2.282855 0.940801
H  -2.770623 -0.846182 1.714809
H  -1.112276 -2.702741 1.360436
H  -1.37226 -2.595666 -0.403809
H  0.828573 -3.366584 -0.01083
H  0.355139 1.450984 0.696159
H  3.256044 -3.586187 -0.577195
H  5.196812 0.676078 -0.373471
H  1.975663 3.410772 0.66946
H  5.22322 -1.626891 -1.628596
