program: Gaussian 09
title: 000115870
version: EM64L-G09RevD.01
frameworkgroup: C1[X(C4H4Cl3NO2)]
method: RPBEPBE
basis: SDD
operation: Freq
keyword: #p
keyword: freq=noraman
keyword: PBEPBE/SDD
title: #p freq=noraman PBEPBE/SDD
converged: YES YES NO NO
title: Mulliken charges:
elementType: Cl Cl Cl O O N C C C C H H H H
charge: 0.104771 0.075781 0.173435 -0.121579 -0.165343 -0.384275 0.469918 -0.745168 0.273629 -0.790608 0.340384 0.275748 0.247362 0.245943
chargesum: 0.00000
title: Mulliken charges with hydrogens summed into heavy atoms:
elementType: Cl Cl Cl O O N C C C C
charge: 0.104771 0.075781 0.173435 -0.121579 -0.165343 -0.043891 0.469918 -0.745168 0.273629 -0.021554
polarizability: 1.01641231e+02 -6.34589471e+00 9.05846192e+01 1.88764496e+00 -2.44341642e-02 6.89093046e+01
1716.lowfreq: -6.6659 -5.9573 -0.0023 -0.0011 0.0021 3.7630 22.2761 48.0281 72.3825
frequency: 21.5287 48.0052 72.3810 99.1442 109.5618 187.3165 196.1058 213.9646 261.0730 268.3346 330.9898 366.9633 396.4405 518.2102 562.1308 594.3643 687.1944 715.8527 748.7529 768.0613 892.0742 915.3801 999.7878 1037.8448 1149.9150 1192.3421 1381.5951 1431.5053 1463.8883 1465.9963 1655.8911 1696.6535 2990.9793 3076.4059 3140.9389 3494.5539
redmass: 6.0003 7.4643 1.1838 3.9013 7.3861 10.5120 12.5806 14.5706 24.0466 15.3499 8.8207 14.2098 5.9920 5.4961 3.7936 3.8009 1.3976 6.8592 8.4860 9.8415 3.6752 7.6576 2.4467 1.7060 3.8197 3.0758 1.2303 1.4073 1.2364 1.0482 5.7518 10.6475 1.0385 1.0980 1.0984 1.0774
irintensity: 8.8997 1.9735 0.2237 1.2301 4.6323 0.1159 0.1580 2.1950 0.2006 0.2875 0.6887 2.4190 9.1163 54.2125 19.6806 60.6505 124.9136 24.6139 103.1822 76.1931 11.1871 34.2064 19.2797 10.8001 76.3918 221.7703 65.8345 438.2341 195.8038 25.1430 17.0959 216.3901 3.1112 8.8746 5.5731 31.6668
temp: 298.150 k
press: 1.00000 atm
elementType: 17 17 17 8 8 7 6 6 6 6 1 1 1 1
symmnumber: 1
zpe: 210256.4 jmol-1
zpe.correction: 0.080082 hartree
zpe.thermalcorrener: 0.091756 hartree
zpe.thermalcorrenthalpy: 0.092700 hartree
zpe.thermalcorrgfe: 0.039600 hartree
zpe.sumelectzpe: -1739.431806 hartree
zpe.sumelectthermal: -1739.420132 hartree
zpe.sumelectthermalent: -1739.419188 hartree
zpe.sumelectthermalfe: -1739.472288 hartree
dipole: 1.0651 -5.1681 -0.0257
dipole: 5.2768
quadrupole: -76.8682 -84.6130 -77.3704
quadrupole: -13.1281 0.1040 0.2152
quadrupole: 2.7490 -4.9958 2.2468 -13.1281 0.1040 0.2152
hfenergy: -1739.511888 hartree
pointgroup: C01 [X(C4H4Cl3N1O2)]
dipole: -0.3977685 2.0277033 -0.2003175 debye
dipolederiv: -0.2289184 -0.0229279 -0.0366271 -0.0655697 -0.273794 -0.2949959 -0.0946072 -0.25917 -0.6773966 -0.2561106 0.0103069 -0.0035681 -0.0451544 -0.4957608 0.3736986 0.0566194 0.338222 -0.5170286 -0.4967234 0.3144162 0.0800109 0.3396794 -0.3272139 -0.0644051 0.0724812 -0.0627372 -0.10795 -0.4878615 -0.0835138 -0.0025545 0.2529414 -0.7626315 0.0035815 -0.0417329 0.0196209 -0.2191327 -0.750065 -0.0771992 0.0138721 -0.3991721 -0.6786712 0.0492745 0.0544977 0.0469662 -0.2884765 -2.1473506 0.2416165 -0.0014262 0.271628 -0.5068315 0.0225318 0.0303065 -0.0040433 -0.3026215 1.5301339 0.029783 0.044343 -0.5018278 0.9746818 -0.0059438 0.1243343 -0.0106603 0.0698229 0.6290284 -0.4104692 -0.0508242 -0.4489446 1.0661668 -0.0315621 -0.0601431 -0.0341422 1.3928299 2.0702832 -0.0902674 -0.0336975 0.4063915 0.9764487 -0.0868715 -0.0947909 -0.0781552 0.2188873 -0.231926 0.1513915 -0.0104346 0.2541961 -0.3139605 0.0278041 -0.0152383 0.0290967 0.0324998 0.2581263 -0.0166786 -0.0037051 0.003272 0.1490504 0.009958 -0.0378268 0.0198053 0.2872117 -0.0562582 -0.0118399 0.0045 -0.0626059 0.0868792 0.0062679 0.0098451 0.0057631 0.1360656 0.0815405 -0.0262489 -0.0764387 -0.0076692 0.0378189 -0.0745161 -0.0418779 -0.0977319 0.0051831 0.0861013 -0.0083693 0.0765499 0.0028352 0.0678176 0.065178 0.0381329 0.0871658 -0.0298944 unknown
polarizability: 101.497933|-6.6160473|90.5377926|-1.3509424|-1.978134|69.0994291 unknown
InChI: InChI=1S/C4H4Cl3NO2/c1-2(9)8-3(10)4(5,6)7/h8H,1H3
charge 0 multiplicity 1
14 atoms
Cl 1.861861 1.031383 1.695796
Cl 1.743321 1.514361 -1.310922
Cl 3.036255 -1.001211 -0.22394
O  0.194786 -1.785296 0.074613
O  -2.614886 -1.135766 0.172428
N  -0.795915 0.356478 -0.036043
C  0.271402 -0.545805 0.013422
C  1.672142 0.182879 0.031417
C  -2.192786 0.030445 0.037801
C  -3.08054 1.265621 -0.061095
H  -0.560694 1.347922 -0.152174
H  -4.132149 0.950629 -0.009043
H  -2.876367 1.968657 0.767684
H  -2.91373 1.802303 -1.013445
