program: Gaussian 09
title: 000115865
version: EM64L-G09RevD.01
frameworkgroup: C1[X(C8H20O7P2)]
method: RPBEPBE
basis: SDD
operation: Freq
keyword: #p
keyword: freq=noraman
keyword: PBEPBE/SDD
title: #p freq=noraman PBEPBE/SDD
converged: YES YES NO NO
title: Mulliken charges:
elementType: P P O O O O O O O C C C C C C C C H H H H H H H H H H H H H H H H H H H H
charge: 1.471212 1.471213 -0.538167 -0.538162 -0.803773 -0.500354 -0.500354 -0.598933 -0.598934 0.038071 0.038070 -0.670437 -0.662959 -0.662959 -0.670437 -0.499188 -0.499184 0.221494 0.221492 0.208604 0.233334 0.231275 0.207978 0.262851 0.227068 0.227068 0.262849 0.207977 0.231276 0.233335 0.208603 0.245016 0.283285 0.241736 0.283280 0.241735 0.245017
chargesum: 0.00000
title: Mulliken charges with hydrogens summed into heavy atoms:
elementType: P P O O O O O O O C C C C C C C C
charge: 1.471212 1.471213 -0.538167 -0.538162 -0.803773 -0.500354 -0.500354 -0.598933 -0.598934 0.259565 0.259563 0.002777 0.034937 0.034936 0.002777 0.270849 0.270848
polarizability: 1.66238695e+02 2.34171037e-04 1.62898154e+02 -2.50204235e+00 -2.41380037e-04 1.56659692e+02
1716.lowfreq: -7.6065 -7.2815 -4.5696 0.0018 0.0022 0.0023 15.6410 17.3356 25.0009
frequency: 15.3913 17.2889 24.8231 30.4744 45.1590 58.3847 89.9657 96.5953 100.1605 118.8907 128.5005 152.4538 157.4543 165.4183 180.9761 192.7389 192.9509 201.9240 206.1892 222.1763 244.6036 254.0343 268.3622 282.6209 295.1897 301.4147 336.7745 361.5362 380.9511 387.2630 406.6107 435.8637 445.9301 457.9571 460.1661 517.1722 628.8505 666.2391 685.8812 700.8710 756.4505 830.9506 839.2753 903.4169 906.7217 931.1570 931.1967 938.7126 938.9287 951.7788 953.1836 1057.0426 1067.4278 1095.6666 1099.2099 1127.0727 1127.4592 1136.5415 1137.0383 1153.2496 1153.3907 1181.2601 1182.2494 1311.6944 1313.9071 1339.9854 1340.3665 1384.0296 1384.1141 1399.3795 1399.6081 1431.3360 1432.3727 1453.9315 1454.2647 1466.0805 1466.3539 1468.3183 1468.5454 1469.6760 1470.2471 1478.9248 1479.1394 1488.5269 1488.5839 2988.2453 2988.2815 2992.1617 2992.6372 2994.0023 2994.1662 2999.1668 2999.7090 3085.6197 3085.6527 3094.0793 3094.2812 3099.9797 3100.0989 3106.4022 3106.6730 3106.7794 3106.9213 3139.9610 3140.0663
redmass: 2.7268 2.9627 4.8431 3.2223 6.1761 4.8649 3.7369 6.2256 4.3166 2.8665 2.6865 1.1657 1.4619 2.8151 4.0024 1.0721 1.0624 2.5012 2.7719 3.9372 1.2580 1.7765 4.0671 3.0961 5.2563 6.5051 3.6815 7.4997 4.2187 3.8357 4.9011 3.5169 5.2694 3.2689 3.6796 10.6320 6.4798 6.7509 6.4115 7.4649 16.8873 5.2446 4.9675 3.0962 3.2696 1.2038 1.2048 1.3886 1.3779 11.0282 11.3667 15.6542 16.1366 1.6504 1.6586 1.2502 1.2507 1.2408 1.2430 2.0928 2.0968 1.9309 1.9303 1.1997 1.1972 1.4559 1.4565 1.2564 1.2563 1.2126 1.2127 1.1174 1.1144 1.0493 1.0495 1.0479 1.0476 1.0498 1.0497 1.0501 1.0502 1.0548 1.0552 1.0501 1.0502 1.0361 1.0360 1.0292 1.0294 1.0371 1.0367 1.0849 1.0855 1.0989 1.0989 1.0992 1.0991 1.1011 1.1010 1.1009 1.1011 1.1070 1.1067 1.1044 1.1044
irintensity: 0.7155 0.0205 1.2258 0.1235 2.2838 0.2374 6.8962 0.1110 4.7268 9.9566 1.6001 0.0657 0.3163 0.0869 0.3908 0.1160 0.0830 0.0077 9.7929 3.0828 2.9536 6.1249 17.3999 13.4147 0.0044 10.4604 2.5979 186.0042 0.1910 20.9077 2.2032 25.6547 4.4143 9.2746 28.5036 1.7241 91.7981 4.1624 4.8609 122.3404 867.2925 50.1890 260.6802 33.7551 184.8594 0.6962 2.1187 1.8009 0.3127 172.7954 36.9363 60.2005 271.9187 33.2185 109.2395 0.4840 2.1945 2.2356 0.3384 34.7355 0.0826 26.2682 10.6621 14.8299 19.3755 7.0943 2.1890 11.4586 51.2314 44.1172 16.7867 0.9819 17.4384 12.6879 1.1974 8.7272 0.0451 21.0514 0.1159 1.2227 2.1111 4.1231 17.7097 14.2636 22.3262 27.7263 1.7253 73.2678 2.7856 21.0279 18.0482 15.1607 13.8836 0.5387 14.1605 16.4671 48.3067 0.3237 24.6760 62.6949 4.2749 12.3759 3.1837 0.6536 17.2807
temp: 298.150 k
press: 1.00000 atm
elementType: 15 15 8 8 8 8 8 8 8 6 6 6 6 6 6 6 6 1 1 1 1 1 1 1 1 1 1 1 1 1 1 1 1 1 1 1 1
symmnumber: 1
zpe: 759149.3 jmol-1
zpe.correction: 0.289145 hartree
zpe.thermalcorrener: 0.313295 hartree
zpe.thermalcorrenthalpy: 0.314239 hartree
zpe.thermalcorrgfe: 0.232441 hartree
zpe.sumelectzpe: -1524.434998 hartree
zpe.sumelectthermal: -1524.410847 hartree
zpe.sumelectthermalent: -1524.409903 hartree
zpe.sumelectthermalfe: -1524.491701 hartree
dipole: 0.0002 -6.2398 -0.0001
dipole: 6.2398
quadrupole: -118.2799 -116.3653 -113.1293
quadrupole: -0.0001 8.7471 -0.0003
quadrupole: -2.3551 -0.4405 2.7956 -0.0001 8.7471 -0.0003
hfenergy: -1524.7241423 hartree
pointgroup: C01 [X(C8H20O7P2)]
dipole: -0.0000523 -2.4549092 -0.0008087 debye
polarizability: 166.4162641|0.0004967|162.8981527|-2.1278517|0.0024088|156.482124 unknown
InChI: InChI=1S/C8H20O7P2/c1-7(2)13-16(9,11-5)15-17(10,12-6)14-8(3)4/h7-8H,1-6H3
charge 0 multiplicity 1
37 atoms
P  -1.606287 0.919918 0.106059
P  1.606274 0.919995 -0.105469
O  -2.501378 -0.36411 -0.588317
O  2.501402 -0.364466 0.588055
O  0.0000 0.234868 0.000127
O  -1.721272 2.118626 -1.092742
O  1.721308 2.117949 1.094082
O  -1.958283 1.42741 1.562904
O  1.958212 1.428418 -1.562003
C  -2.618289 -1.691544 0.132127
C  2.61827 -1.691452 -0.133218
C  -3.073878 -2.662374 -0.958533
C  -3.596584 -1.564798 1.307206
C  3.596502 -1.563987 -1.308273
C  3.073924 -2.662961 0.956811
C  -1.333807 1.833888 -2.507259
C  1.333775 1.832365 2.508409
H  -1.604224 -1.958137 0.4916
H  1.604184 -1.957816 -0.492802
H  -3.176355 -3.679034 -0.53695
H  -2.345577 -2.69385 -1.786167
H  -4.052841 -2.350906 -1.362192
H  -3.689124 -2.539216 1.821886
H  -3.250935 -0.813613 2.038069
H  -4.595198 -1.265491 0.943946
H  4.59514 -1.264918 -0.944881
H  3.250828 -0.812346 -2.038655
H  3.6890 -2.538088 -1.82356
H  4.052896 -2.351724 1.360624
H  2.34566 -2.694982 1.784457
H  3.176409 -3.679353 0.534582
H  -1.652609 2.735957 -3.049012
H  -0.239535 1.705148 -2.577532
H  -1.871257 0.945133 -2.878336
H  0.239512 1.703466 2.578545
H  1.871299 0.943461 2.879019
H  1.652439 2.734164 3.050693
