program: Gaussian 09
title: 000115861
version: EM64L-G09RevD.01
frameworkgroup: C1[X(C16H17NO)]
method: RPBEPBE
basis: SDD
operation: Freq
keyword: #p
keyword: freq=noraman
keyword: PBEPBE/SDD
title: #p freq=noraman PBEPBE/SDD
converged: YES YES NO NO
title: Mulliken charges:
elementType: O N C C C C C C C C C C C C C C C C H H H H H H H H H H H H H H H H H
charge: -0.456455 -0.040316 -0.595002 -0.670739 0.343575 0.303158 0.228026 0.241841 -0.329272 -0.444811 -0.414121 -0.408240 -0.414875 -0.343635 -0.241703 -0.244134 -0.246667 -0.247011 0.223671 0.204729 0.232888 0.256221 0.200662 0.226719 0.237859 0.234788 0.248816 0.247557 0.207336 0.201488 0.228343 0.227839 0.228394 0.228004 0.345065
chargesum: 0.00000
title: Mulliken charges with hydrogens summed into heavy atoms:
elementType: O N C C C C C C C C C C C C C C C C
charge: -0.111390 -0.040316 -0.166602 -0.181630 0.343575 0.303158 0.228026 0.241841 0.098110 -0.206952 -0.179333 -0.159424 -0.167319 0.065189 -0.013359 -0.016295 -0.018273 -0.019008
polarizability: 2.09108852e+02 -1.54296383e+01 2.28367484e+02 -9.15842613e+00 -4.76868688e+00 1.06095506e+02
1716.lowfreq: -11.0959 -0.0006 -0.0005 -0.0003 2.0299 10.3606 33.5468 48.7710 73.7812
frequency: 33.4251 48.5718 73.7606 85.0831 102.9890 132.9322 150.2896 211.8161 249.0514 254.6287 276.6631 301.6975 326.5357 343.9675 391.0697 410.2591 430.9807 464.3078 503.0419 505.2221 510.9836 568.4483 604.1801 618.0236 642.9258 705.9582 732.5630 749.8526 758.8994 780.8148 814.8917 820.3005 828.0122 849.5252 877.6033 891.1207 933.1986 951.6376 955.0492 975.5446 979.8779 987.7802 988.1650 995.9860 1018.3975 1042.2675 1045.1950 1067.6707 1078.9099 1115.1679 1128.0739 1135.5316 1173.8542 1174.9031 1190.7422 1201.0794 1210.4206 1215.1969 1221.1639 1255.9640 1278.5577 1292.2101 1296.1552 1306.2091 1330.8853 1350.0744 1367.7442 1374.4738 1377.6498 1410.0628 1433.5350 1436.4103 1460.4180 1468.7256 1471.9521 1479.3517 1486.1855 1490.0225 1569.6437 1585.0456 1608.2701 1611.4411 2850.9855 2890.4542 2947.3310 2996.7918 3005.0761 3022.8935 3051.3244 3063.3844 3115.2241 3120.6792 3124.5855 3128.4960 3139.6276 3142.5971 3160.0042 3161.6672 3575.3794
redmass: 3.3225 2.6190 4.8719 4.1435 3.9299 3.8148 3.9132 3.3277 1.2648 2.8229 4.2011 3.5127 3.2317 4.2022 3.6479 2.9574 3.5764 2.8043 3.3402 3.3410 4.3601 3.4001 4.7020 6.7271 4.4153 4.0969 3.9019 2.5038 1.3814 1.7560 1.8528 1.9660 2.5610 3.3283 1.4413 1.6733 1.7735 1.5217 1.4299 6.2106 1.8735 1.3333 1.3318 7.1203 2.4667 2.2933 2.2622 2.2269 2.4642 1.8377 1.6611 1.7776 1.0600 1.0671 1.9792 1.3369 1.8602 1.4433 1.3666 1.7072 1.2099 1.7725 1.4873 1.4992 1.2131 1.3319 1.9015 2.4925 6.1706 1.4641 2.4469 2.1996 1.1214 1.2539 1.7085 1.1366 1.0843 3.0588 6.0576 6.9630 6.3290 6.5516 1.0712 1.0691 1.0557 1.0621 1.1031 1.0875 1.0946 1.0998 1.0870 1.0855 1.0880 1.0887 1.0937 1.0940 1.1006 1.1007 1.0666
irintensity: 3.9814 11.1058 0.3652 0.3874 2.2406 0.5136 0.0888 5.1513 125.6924 29.2868 0.5150 5.0068 2.5141 0.6917 15.9486 1.2111 8.5044 1.8365 10.4258 3.1647 2.6074 0.5371 11.3113 5.7753 3.0169 0.5131 3.9179 41.4416 106.2370 16.2112 0.7852 2.6980 1.8271 5.1591 1.0816 0.1459 20.5074 9.3676 4.1350 89.0137 2.0986 0.2784 0.1425 5.5775 19.9633 2.9722 11.1403 6.3086 24.0911 2.6557 8.7654 4.5731 0.0749 0.0364 10.0829 23.8340 2.6838 6.7940 17.3991 0.6748 6.5525 0.4325 1.8513 2.5174 3.7884 0.1988 4.0803 2.1898 0.1008 0.3977 8.1270 10.2787 10.6901 5.8212 16.9580 16.4283 1.6568 1.9937 0.5118 0.3407 0.1222 0.1759 52.6445 58.3039 52.5089 31.3117 47.1271 35.6057 29.8111 37.0117 9.0045 4.9662 3.0202 5.8340 24.4209 26.7361 45.8745 25.5898 3.3287
temp: 298.150 k
press: 1.00000 atm
elementType: 8 7 6 6 6 6 6 6 6 6 6 6 6 6 6 6 6 6 1 1 1 1 1 1 1 1 1 1 1 1 1 1 1 1 1
symmnumber: 1
zpe: 760069.5 jmol-1
zpe.correction: 0.289495 hartree
zpe.thermalcorrener: 0.304912 hartree
zpe.thermalcorrenthalpy: 0.305857 hartree
zpe.thermalcorrgfe: 0.246231 hartree
zpe.sumelectzpe: -748.561554 hartree
zpe.sumelectthermal: -748.546136 hartree
zpe.sumelectthermalent: -748.545192 hartree
zpe.sumelectthermalfe: -748.604818 hartree
dipole: 0.4016 -1.0787 -0.6440
dipole: 1.3189
quadrupole: -98.7988 -93.8510 -109.0316
quadrupole: 7.1376 0.1986 2.4310
quadrupole: 1.7617 6.7095 -8.4711 7.1376 0.1986 2.4310
hfenergy: -748.851049 hartree
pointgroup: C01 [X(C16H17N1O1)]
dipole: 0.1782879 -0.4186145 -0.2494721 debye
polarizability: 210.6061836|-16.1432899|227.0148169|-7.6676591|-5.8646334|105.950842 unknown
InChI: InChI=1S/C16H17NO/c18-10-9-17-11-13-5-1-3-7-15(13)16-8-4-2-6-14(16)12-17/h1-8,18H,9-12H2
charge 0 multiplicity 1
35 atoms
O  -5.157698 -0.94055 -0.607431
N  -1.614292 -0.788971 0.571936
C  -0.757931 -1.272479 -0.558379
C  -0.912522 0.229238 1.41414
C  0.712743 -1.447814 -0.209624
C  -0.229145 1.348883 0.630338
C  1.561356 -0.305846 -0.05144
C  0.987441 1.07139 -0.070011
C  -2.943882 -0.337122 0.088415
C  1.277454 -2.743303 -0.141026
C  -0.764531 2.658393 0.597818
C  2.954185 -0.504021 0.141356
C  1.642346 2.125411 -0.760584
C  -3.831421 -1.519349 -0.327198
C  2.663571 -2.929265 0.061707
C  -0.109803 3.698114 -0.099945
C  3.505884 -1.801885 0.1943
C  1.102162 3.42893 -0.777734
H  -1.162039 -2.239166 -0.90961
H  -0.827953 -0.555816 -1.416262
H  -1.655721 0.647561 2.115439
H  -0.157538 -0.308402 2.017643
H  -2.873705 0.380217 -0.765127
H  -3.459878 0.181878 0.916382
H  0.621706 -3.614449 -0.257447
H  -1.697024 2.866834 1.137181
H  3.602419 0.368771 0.280284
H  2.567201 1.91217 -1.309211
H  -3.872455 -2.250457 0.506292
H  -3.43017 -2.024824 -1.230772
H  3.081613 -3.940707 0.111977
H  -0.537193 4.706974 -0.113319
H  4.582427 -1.933241 0.350418
H  1.616881 4.227445 -1.323625
H  -5.776491 -1.658144 -0.892881
