program: Gaussian 09
title: 000115858
version: EM64L-G09RevD.01
frameworkgroup: C1[X(C20H24N2)]
method: RPBEPBE
basis: SDD
operation: Freq
keyword: #pfreq=noraman
keyword: PBEPBE/SDD
title: #p freq=noraman PBEPBE/SDD
converged: YES YES NO NO
title: Mulliken charges:
elementType: N N C C C C C C C C C C C C C C C C C C C C H H H H H H H H H H H H H H H H H H H H H H H H
charge: -0.277218 -0.102084 -0.434826 -0.386515 0.223116 0.168111 -0.327519 -0.326875 0.374624 0.382851 -0.336491 -0.327373 -0.351526 -0.344368 -0.672331 -0.673815 -0.409536 -0.404882 -0.246847 -0.249894 -0.271290 -0.269808 0.256237 0.193365 0.232139 0.220580 0.203032 0.189547 0.204138 0.191230 0.237214 0.249369 0.211433 0.211679 0.213338 0.225923 0.205883 0.208928 0.225222 0.205973 0.235067 0.233439 0.226344 0.225984 0.229314 0.229118
chargesum: 0.00000
title: Mulliken charges with hydrogens summed into heavy atoms:
elementType: N N C C C C C C C C C C C C C C C C C C C C
charge: -0.277218 -0.102084 0.014776 0.066205 0.223116 0.168111 0.065060 0.068493 0.374624 0.382851 -0.099278 -0.078004 -0.140093 -0.132689 -0.027187 -0.033692 -0.174469 -0.171442 -0.020503 -0.023910 -0.041975 -0.040690
polarizability: 2.38428893e+02 3.71346955e+01 2.95306236e+02 -3.25338845e+01 1.48387597e+01 1.87876103e+02
1716.lowfreq: -5.9940 -4.1423 -0.0005 0.0004 0.0007 10.3562 20.1545 25.4578 42.0910
frequency: 17.4639 25.1573 41.8410 55.8326 64.7548 75.7356 92.8433 110.0661 139.6591 159.0312 181.9154 209.6585 225.7435 232.3549 267.2678 285.3698 306.2316 317.0361 335.9993 343.9587 381.8639 390.8263 411.0611 436.2564 450.2945 469.7688 480.9997 513.6614 530.0670 563.0544 583.4845 598.4554 613.0975 679.7298 705.3699 714.4232 737.1593 744.8700 758.1328 762.8776 784.0247 791.0839 796.8993 803.7280 810.8575 836.0220 864.2955 870.3318 899.7436 915.8101 939.1833 941.7090 972.0867 975.3228 982.4764 988.2067 1029.1343 1044.7688 1046.4380 1056.2352 1064.7827 1074.9922 1078.5418 1084.7962 1114.4322 1120.6776 1128.3680 1163.0949 1163.8033 1172.9177 1174.7380 1205.9028 1216.9528 1227.5764 1235.2363 1248.8375 1258.2223 1277.6202 1286.9303 1295.7670 1297.3758 1303.8546 1334.3784 1360.9652 1361.8891 1373.9898 1378.5576 1386.5650 1386.6941 1387.6655 1405.5054 1421.8497 1453.7194 1459.9004 1463.6160 1468.9642 1472.8282 1476.9594 1481.8848 1486.5021 1490.9880 1493.0868 1495.5388 1571.1651 1582.1591 1597.8262 1600.6528 1647.1197 2852.3019 2861.1825 2919.5260 2929.5621 2982.2895 2982.6691 3013.3433 3030.8596 3050.2092 3073.6185 3075.4447 3076.8032 3086.6203 3090.1833 3091.2431 3113.6164 3119.1185 3120.5175 3129.7841 3130.7599 3148.3959 3148.9614 3163.9777 3164.5876
redmass: 3.3975 3.8028 3.8595 4.8080 3.0549 3.0464 2.2112 3.2722 2.5215 2.5944 1.9282 2.7953 1.5421 2.0728 2.2295 1.9827 3.2917 3.3367 3.9384 3.6892 3.4083 3.7078 4.3076 2.9847 2.9796 4.1274 2.8737 3.6681 3.7484 5.3045 3.3609 4.5787 5.2463 5.3755 4.8843 1.9755 3.0713 2.2164 1.4958 1.7467 1.4357 1.4792 1.1780 1.4890 2.3789 2.7477 1.5747 1.5214 4.0776 2.0083 1.4079 1.4028 1.3183 1.3250 1.3116 2.2468 5.1865 2.4446 2.1963 3.0346 1.8620 1.9246 2.7891 2.1404 1.9070 1.7918 1.9719 1.9759 1.6049 1.0664 1.0838 2.2820 2.1160 2.7838 2.0339 1.4104 1.4413 1.2093 1.2322 1.4028 1.2533 1.6817 1.5135 1.3534 1.3792 3.5958 1.9755 1.7240 1.9924 1.3102 1.6426 2.0829 2.1438 1.0583 1.0529 1.0735 1.8835 1.1913 1.0866 1.0652 1.0901 1.9934 1.2826 6.2422 7.5031 6.2202 5.9911 7.5837 1.0719 1.0713 1.0694 1.0704 1.0358 1.0357 1.0878 1.0873 1.0888 1.0977 1.0974 1.0945 1.0836 1.1003 1.1003 1.0942 1.0873 1.0872 1.0882 1.0878 1.0930 1.0929 1.1005 1.1005
irintensity: 0.1058 0.0732 0.2509 0.5059 0.2713 0.1531 0.3113 0.3634 0.3865 0.8120 1.0709 0.1707 0.2124 4.4864 2.1186 1.0715 0.8079 0.9809 0.6832 1.4790 0.5269 1.1894 3.7908 5.0315 7.3124 3.8908 15.6399 5.7495 1.8943 2.2971 0.4966 16.1543 9.7847 0.1877 1.0403 6.7897 0.3391 24.4945 44.3335 63.0642 18.6120 2.6338 9.3584 60.2636 1.2233 7.7771 1.8207 3.7762 12.9470 0.8518 1.5743 9.2386 0.7564 0.0654 1.0229 4.9208 6.9623 1.0339 17.6936 17.8904 24.4483 11.8816 38.5570 2.8797 43.7918 9.6097 22.9692 1.2143 15.6320 0.2669 1.0505 32.6068 12.7163 45.1197 45.5569 1.7224 10.6423 5.3991 23.8461 1.3519 8.0452 50.6248 22.9922 4.1801 4.1563 1.7946 0.7774 12.3322 12.6216 19.4955 6.9263 17.1255 61.3678 6.0321 7.5285 4.0242 71.2524 17.6306 11.0433 5.7226 13.3733 20.4241 5.0420 6.1894 11.6969 15.5404 15.7645 0.9786 30.3987 157.9699 53.1268 65.1167 42.3736 23.1775 27.3288 22.0258 11.5229 13.0412 95.1255 29.3331 0.1976 41.8912 39.1331 18.8573 6.5387 27.6237 6.1145 10.2790 12.4682 45.0401 50.2431 13.0566
temp: 298.150 k
press: 1.00000 atm
elementType: 7 7 6 6 6 6 6 6 6 6 6 6 6 6 6 6 6 6 6 6 6 6 1 1 1 1 1 1 1 1 1 1 1 1 1 1 1 1 1 1 1 1 1 1 1 1
symmnumber: 1
zpe: 1022530.2 jmol-1
zpe.correction: 0.389461 hartree
zpe.thermalcorrener: 0.410120 hartree
zpe.thermalcorrenthalpy: 0.411064 hartree
zpe.thermalcorrgfe: 0.338556 hartree
zpe.sumelectzpe: -884.390101 hartree
zpe.sumelectthermal: -884.369442 hartree
zpe.sumelectthermalent: -884.368498 hartree
zpe.sumelectthermalfe: -884.441006 hartree
dipole: 1.1333 0.3792 0.2124
dipole: 1.2137
quadrupole: -125.2559 -125.5540 -127.7707
quadrupole: 3.8266 -6.0864 2.1104
quadrupole: 0.9377 0.6395 -1.5772 3.8266 -6.0864 2.1104
hfenergy: -884.7795619 hartree
pointgroup: C01 [X(C20H24N2)]
dipole: 0.4614656 -0.1168885 -0.0376317 debye
polarizability: 244.0219331|-32.9511483|289.0993045|42.7814886|-9.516794|188.4899947 unknown
InChI: InChI=1S/C20H24N2/c1-3-21(4-2)15-16-22-19-11-7-5-9-17(19)13-14-18-10-6-8-12-20(18)22/h5-14H,3-4,15-16H2,1-2H3
charge 0 multiplicity 1
46 atoms
N  -0.348283 0.121795 0.124912
N  3.371014 0.804426 -0.342848
C  0.958858 0.810275 0.268596
C  2.063175 0.144825 -0.588813
C  -0.444088 -1.253063 0.542873
C  -1.529668 0.943496 0.086242
C  4.195659 0.968206 -1.569384
C  4.114842 0.192061 0.791219
C  -1.252303 -2.191177 -0.179876
C  -2.633135 0.617235 -0.76836
C  0.330361 -1.715209 1.63912
C  -1.570405 2.14877 0.835374
C  -2.104929 -1.81985 -1.318562
C  -2.700186 -0.612081 -1.571196
C  3.671567 2.081448 -2.496233
C  5.084479 1.172365 1.478974
C  -1.218925 -3.559156 0.210042
C  -3.712883 1.538831 -0.863867
C  0.341745 -3.07706 2.01177
C  -2.655859 3.045599 0.727123
C  -0.435705 -4.010962 1.291481
C  -3.736168 2.742957 -0.131192
H  0.834887 1.843287 -0.09507
H  1.301934 0.890203 1.323869
H  2.106675 -0.94947 -0.386746
H  1.782403 0.258455 -1.650464
H  5.221519 1.230533 -1.252064
H  4.277325 0.008072 -2.139819
H  3.36953 -0.146085 1.536299
H  4.669132 -0.725573 0.467426
H  0.938724 -1.002782 2.20508
H  -0.740541 2.390265 1.507433
H  -2.362175 -2.649561 -1.992001
H  -3.387159 -0.567162 -2.428025
H  2.645718 1.872472 -2.850564
H  3.655651 3.046004 -1.959568
H  4.31949 2.180183 -3.387407
H  5.870694 1.528493 0.788873
H  4.533182 2.054941 1.847702
H  5.588159 0.683232 2.333938
H  -1.825051 -4.275383 -0.358249
H  -4.545494 1.294866 -1.535129
H  0.958736 -3.403403 2.856597
H  -2.652703 3.974408 1.308501
H  -0.427735 -5.071399 1.564208
H  -4.579363 3.434374 -0.230915
