program: Gaussian 09
title: 000115852
version: EM64L-G09RevD.01
frameworkgroup: C1[X(C15H26O)]
method: RPBEPBE
basis: SDD
operation: Freq
keyword: #pfreq=noraman
keyword: PBEPBE/SDD
title: #p freq=noraman PBEPBE/SDD
converged: YES YES NO NO
title: Mulliken charges:
elementType: O C C C C C C C C C C C C C C C H H H H H H H H H H H H H H H H H H H H H H H H H H
charge: -0.427703 0.448183 -0.157113 0.363470 0.399052 -0.643041 -0.241038 -0.522234 -0.493583 -0.579102 -0.478873 -0.451650 -0.433609 -0.785372 -0.763887 -0.776282 0.200908 0.205900 0.203248 0.230921 0.218003 0.197637 0.205028 0.197373 0.213914 0.223183 0.205870 0.201530 0.195635 0.189237 0.205510 0.197602 0.218655 0.216427 0.213703 0.215767 0.209665 0.212499 0.207832 0.213452 0.212296 0.330987
chargesum: 0.00000
title: Mulliken charges with hydrogens summed into heavy atoms:
elementType: O C C C C C C C C C C C C C C C
charge: -0.096715 0.448183 0.043795 0.363470 0.399052 -0.233893 -0.010118 -0.106593 -0.091182 -0.142004 -0.071473 -0.066778 -0.030498 -0.136587 -0.125957 -0.142702
polarizability: 1.68013047e+02 -1.84570410e+00 1.48829797e+02 1.28618978e+00 1.83353623e+00 1.42541527e+02
1716.lowfreq: -22.3269 -15.4840 -0.0008 -0.0006 -0.0005 5.8618 67.1516 93.7443 139.0855
frequency: 67.0648 93.7420 139.0531 163.7624 211.3789 225.2393 230.9044 240.8578 243.2929 266.5063 280.7257 295.2220 316.1972 324.1057 340.2771 352.6038 361.7862 386.6991 397.4452 413.3640 448.9859 469.9501 483.2419 507.6073 526.3252 559.2202 586.1303 612.9144 696.7015 741.7596 771.4161 811.6584 845.3402 854.4708 864.3011 872.7041 894.3343 919.1627 929.5530 934.7651 941.5366 966.3179 969.2563 976.6955 990.0435 1004.7911 1028.9192 1033.0822 1046.3072 1055.3872 1081.3807 1091.1606 1103.3161 1119.8564 1139.2772 1146.0176 1155.3255 1181.1378 1197.0871 1203.4379 1210.9302 1216.4351 1228.5347 1260.7165 1271.6052 1287.7903 1295.6187 1300.8737 1305.0774 1308.2752 1321.7918 1326.3620 1337.4028 1340.4351 1349.2778 1352.7937 1357.8012 1371.8144 1377.4020 1383.6799 1393.9987 1451.1555 1453.6260 1460.1801 1463.1571 1466.6082 1468.9723 1472.2935 1472.9488 1475.7879 1477.0326 1486.4483 1490.4729 1503.5451 2938.8082 2951.0258 2953.7672 2957.5245 2959.5915 2960.8034 2965.7173 2970.3373 2974.4541 2985.9692 2990.9490 3004.6224 3009.2313 3011.5536 3012.6133 3014.3457 3034.8272 3050.5363 3053.2713 3056.2639 3056.7761 3058.9596 3060.5263 3062.1390 3080.7332 3547.4595
redmass: 2.9164 3.0055 3.1496 2.8436 1.4949 1.4550 1.9028 2.0554 1.4235 2.2867 1.3937 2.4031 2.1492 2.0176 1.8124 1.3706 2.7455 2.3760 1.9787 2.1620 2.6586 3.1697 2.5318 2.8303 3.5606 2.9328 2.3960 3.2996 1.9721 3.0728 2.5038 1.6339 1.8597 2.6958 2.1920 2.1295 2.2639 1.9549 1.8712 2.0307 1.7407 1.8216 1.7958 1.8373 1.9389 1.4719 1.6681 2.1150 1.9846 1.7181 1.8815 1.8516 1.9562 1.5227 1.5958 1.4825 3.2665 1.8143 1.5812 1.8384 1.9510 2.0771 1.8362 1.7029 1.4694 1.5059 1.6894 1.5678 1.4959 1.6540 1.2749 1.5454 1.4036 1.5217 1.4806 1.4340 1.4195 1.2047 1.1925 1.2168 1.2068 1.0771 1.0797 1.0713 1.0775 1.0596 1.0810 1.0588 1.0685 1.0691 1.0650 1.0698 1.0557 1.0785 1.0822 1.0594 1.0576 1.0588 1.0426 1.0356 1.0555 1.0593 1.0439 1.0640 1.0670 1.0988 1.0992 1.0995 1.0940 1.0936 1.1001 1.0987 1.0971 1.0984 1.0983 1.0988 1.0981 1.0991 1.0978 1.0654
irintensity: 0.0365 0.8668 1.4665 0.4663 0.6416 0.2411 0.6319 0.0985 0.0620 0.2688 0.0673 0.9351 0.8209 1.2821 55.4894 79.4236 1.6272 0.9075 1.3860 0.3792 5.1066 0.8337 4.4915 5.0486 3.2024 2.2424 0.0737 2.8525 0.6456 0.1618 2.8376 2.8099 2.1636 1.1975 1.1115 3.2418 8.8816 1.9938 7.3361 12.0179 11.2803 8.4709 5.1835 9.6485 6.3439 9.5095 1.1610 54.9781 15.5351 9.9188 2.1628 0.9636 0.7031 0.7427 4.3906 4.0609 4.7160 17.8923 5.3782 6.7760 6.0083 4.2230 3.7251 13.3125 6.6623 1.8115 3.1089 4.2401 1.5094 2.1230 0.1711 1.1391 1.7230 1.0454 0.5886 3.9759 4.2684 17.5957 34.7923 7.8501 14.0183 0.5407 1.4476 2.4788 13.9548 1.5438 12.8935 7.7770 0.5008 8.1729 18.8963 13.2059 13.7048 18.5120 21.6054 23.4725 19.1633 47.8022 22.0616 36.4375 85.4496 23.5144 32.4181 71.4780 39.3385 38.9554 3.1755 34.5085 22.9034 35.3622 81.2347 11.8082 37.4672 64.9493 14.7871 65.3590 75.1625 54.4889 49.3462 5.7106
temp: 298.150 k
press: 1.00000 atm
elementType: 8 6 6 6 6 6 6 6 6 6 6 6 6 6 6 6 1 1 1 1 1 1 1 1 1 1 1 1 1 1 1 1 1 1 1 1 1 1 1 1 1 1
symmnumber: 1
zpe: 996338.3 jmol-1
zpe.correction: 0.379485 hartree
zpe.thermalcorrener: 0.395243 hartree
zpe.thermalcorrenthalpy: 0.396187 hartree
zpe.thermalcorrgfe: 0.339370 hartree
zpe.sumelectzpe: -661.130942 hartree
zpe.sumelectthermal: -661.115184 hartree
zpe.sumelectthermalent: -661.114240 hartree
zpe.sumelectthermalfe: -661.171057 hartree
dipole: -0.2511 -2.0290 -0.1049
dipole: 2.0472
quadrupole: -100.2593 -110.3555 -97.3883
quadrupole: -2.9930 0.1934 0.4880
quadrupole: 2.4084 -7.6878 5.2794 -2.9930 0.1934 0.4880
hfenergy: -661.5104274 hartree
pointgroup: C01 [X(C15H26O1)]
dipole: 0.1118889 0.796267 -0.0464422 debye
polarizability: 167.9051376|-2.204138|148.8819584|-1.6415034|-1.8115955|142.5972753 unknown
InChI: InChI=1S/C15H26O/c1-13(2)9-12(16)15-7-4-6-14(3,10-15)8-5-11(13)15/h11-12,16H,4-10H2,1-3H3
charge 0 multiplicity 1
42 atoms
O  -1.037669 -2.781455 -1.097657
C  -0.066823 -0.818218 0.223451
C  -0.744168 0.442885 0.858156
C  -2.083951 0.710618 0.030387
C  1.940356 0.533862 -0.580392
C  0.796626 -0.427531 -1.003091
C  -1.315862 -1.650359 -0.199816
C  0.826498 -1.620886 1.204494
C  0.217925 1.645547 1.077242
C  -2.31074 -0.617173 -0.775096
C  1.298394 1.841917 -0.021314
C  2.849601 -0.209284 0.448343
C  2.106882 -0.866092 1.641274
C  -3.249824 0.954529 1.02693
C  -2.025912 1.916874 -0.942958
C  2.801756 0.903894 -1.813356
H  -1.086413 0.128503 1.86841
H  1.239399 -1.342169 -1.449565
H  0.185179 0.061343 -1.788281
H  -1.735334 -2.14565 0.696399
H  1.103594 -2.569508 0.699846
H  0.236499 -1.902159 2.101025
H  0.721063 1.515941 2.052215
H  -0.369784 2.580202 1.176607
H  -2.084255 -0.458207 -1.849447
H  -3.354427 -0.973728 -0.717236
H  0.851603 2.380067 -0.881088
H  2.099371 2.501117 0.371569
H  3.625961 0.48669 0.826812
H  3.387708 -1.005582 -0.108264
H  1.849283 -0.101033 2.395525
H  2.794339 -1.571038 2.14953
H  -3.415726 0.07161 1.672429
H  -3.0317 1.817478 1.685472
H  -4.195355 1.166935 0.492413
H  -2.9862 2.001378 -1.487083
H  -1.864497 2.871454 -0.408526
H  -1.226648 1.808203 -1.697166
H  2.192474 1.401233 -2.592262
H  3.620931 1.594665 -1.534541
H  3.258956 0.002544 -2.264318
H  -0.77791 -2.420316 -1.983773
