program: Gaussian 09
title: 000115849
version: EM64L-G09RevD.01
frameworkgroup: C1[X(C13H22O2)]
method: RPBEPBE
basis: SDD
operation: Freq
keyword: #pfreq=noraman
keyword: PBEPBE/SDD
title: #p freq=noraman PBEPBE/SDD
converged: YES YES NO NO
title: Mulliken charges:
elementType: O O C C C C C C C C C C C C C H H H H H H H H H H H H H H H H H H H H H H
charge: -0.281768 -0.259983 -0.378339 -0.339833 -0.484347 -0.344147 -0.111120 -0.156846 -0.204872 -0.496551 -0.694477 -0.032309 0.315750 -0.596127 -0.755275 0.200414 0.194245 0.183179 0.203730 0.205264 0.211984 0.193361 0.191342 0.254262 0.238708 0.262328 0.218948 0.215745 0.209457 0.208934 0.215252 0.243648 0.214673 0.217208 0.245440 0.247962 0.244161
chargesum: 0.00000
title: Mulliken charges with hydrogens summed into heavy atoms:
elementType: O O C C C C C C C C C C C C C
charge: -0.281768 -0.259983 0.016319 0.047076 -0.067099 0.040556 0.143142 0.081862 0.057456 -0.061858 -0.060834 0.211339 0.315750 -0.164246 -0.017711
polarizability: 1.72207099e+02 4.79378841e+00 1.57517377e+02 -1.47401167e+00 7.71707478e+00 1.17634592e+02
1716.lowfreq: -8.2867 -2.8013 -0.0007 -0.0005 -0.0004 5.7856 15.2529 27.7923 34.3834
frequency: 13.7206 27.7274 34.1559 44.9048 56.8035 58.8023 64.8135 75.8110 103.2280 119.2145 133.5123 152.5092 176.3969 217.8918 232.6849 237.3377 276.8618 311.2277 350.0598 379.6230 389.6018 425.4976 463.2037 507.8531 545.1348 569.4376 609.7376 674.0458 726.4971 772.2653 793.9512 816.1972 857.2344 868.1158 894.3126 896.7009 916.4336 922.7524 946.2369 976.1983 981.0915 992.3999 1004.3037 1019.0615 1030.7787 1041.4168 1056.1616 1085.1981 1093.4938 1107.2330 1142.6638 1168.8892 1185.1139 1196.6586 1211.8223 1228.3064 1247.3386 1269.9421 1276.3334 1283.7317 1285.1110 1288.6744 1294.0342 1312.4465 1324.7376 1334.9420 1355.4556 1371.5178 1380.5430 1390.1925 1428.9167 1444.6206 1452.5895 1456.0866 1456.3322 1462.8349 1467.3134 1477.7714 1478.6288 1487.5540 1641.4105 1659.2740 1677.5029 2956.0288 2958.8892 2964.7444 2970.6976 2972.1072 2976.6343 2995.8965 3004.3995 3012.2886 3025.4965 3037.9215 3039.3203 3044.5679 3068.4241 3071.0342 3078.9933 3084.9409 3098.2501 3105.0231 3110.0625 3138.6253 3193.8325
redmass: 4.1656 3.2139 1.1848 4.4424 2.2592 2.4220 2.8402 2.8178 2.6234 2.5072 2.5576 2.4817 2.7112 2.9062 2.0641 1.4389 3.3528 2.5420 3.3618 2.4802 2.4977 2.6671 2.6089 2.4494 2.2527 3.3648 4.5443 2.1436 1.0899 1.2614 2.4234 2.0363 2.2487 2.3201 3.3461 1.8430 1.5978 1.6687 1.3423 1.6653 1.2610 1.8255 1.8094 1.2649 1.6401 1.6530 2.4750 2.0308 2.3361 1.9373 1.7995 2.5303 1.4740 2.8947 1.3898 1.3245 1.3520 1.3441 1.2561 1.2150 1.2818 1.1022 1.2995 1.2700 1.3661 1.4165 1.5981 1.4275 1.2424 1.2151 1.1684 1.1160 1.0592 1.0540 1.0971 1.0746 1.0725 1.0694 1.0443 1.0816 9.6730 4.7156 6.5295 1.0595 1.0597 1.0607 1.0583 1.0378 1.0617 1.0969 1.0379 1.1011 1.0996 1.0869 1.1033 1.0974 1.1006 1.0993 1.0923 1.0601 1.0945 1.0895 1.0936 1.1022 1.1141
irintensity: 0.1392 0.0844 0.9223 0.4621 0.0895 1.6455 0.6698 1.1329 0.0574 0.6583 1.7064 0.7001 2.2266 3.7404 4.3360 1.0007 1.4397 2.7642 2.4105 1.0621 0.7602 3.3218 7.1940 3.6425 5.7334 9.3212 2.9563 10.0751 11.5781 2.4152 20.0731 10.1947 9.4356 17.4751 60.9970 18.5638 4.5958 32.1420 78.9621 10.2378 90.4259 56.1676 5.2436 19.3036 38.1334 9.8158 1.1538 0.7940 1.6533 13.9618 1.9476 14.5518 18.0154 326.3543 2.9660 14.4011 2.9411 1.2073 1.9965 1.6050 5.1529 0.2486 1.1587 0.2096 1.6708 0.6446 2.3858 12.5129 52.1424 11.7134 5.7039 17.8316 21.1104 18.6020 17.0680 0.8210 0.5789 3.4169 12.2574 15.6379 159.4241 13.4188 28.0884 8.0613 13.8249 12.0619 127.6624 23.4196 20.4421 2.1966 3.3628 7.0111 15.8114 15.0206 78.0161 23.4072 87.9407 56.6714 17.9124 11.8146 10.1994 15.4359 9.9020 10.2664 28.9992
temp: 298.150 k
press: 1.00000 atm
elementType: 8 8 6 6 6 6 6 6 6 6 6 6 6 6 6 1 1 1 1 1 1 1 1 1 1 1 1 1 1 1 1 1 1 1 1 1 1
symmnumber: 1
zpe: 837967.9 jmol-1
zpe.correction: 0.319165 hartree
zpe.thermalcorrener: 0.338291 hartree
zpe.thermalcorrenthalpy: 0.339235 hartree
zpe.thermalcorrgfe: 0.267676 hartree
zpe.sumelectzpe: -657.797221 hartree
zpe.sumelectthermal: -657.778095 hartree
zpe.sumelectthermalent: -657.777151 hartree
zpe.sumelectthermalfe: -657.848711 hartree
dipole: 0.3905 0.8360 1.0336
dipole: 1.3856
quadrupole: -85.7523 -97.6470 -91.7609
quadrupole: -2.1730 -3.3992 -3.8353
quadrupole: 5.9678 -5.9270 -0.0408 -2.1730 -3.3992 -3.8353
hfenergy: -658.1163861 hartree
pointgroup: C01 [X(C13H22O2)]
dipole: -0.1880285 -0.2541493 0.4441057 debye
polarizability: 173.1321355|2.8593382|153.9900699|-0.2762548|-12.5146643|120.2368635 unknown
InChI: InChI=1S/C13H22O2/c1-4-6-7-8-9-11-13(10-5-2)15-12(3)14/h5,9,11,13H,2,4,6-8,10H2,1,3H3
charge 0 multiplicity 1
37 atoms
O  2.730686 -0.496064 -0.04274
O  2.909507 1.474218 -1.289186
C  -2.694558 2.053234 0.29341
C  -3.448685 0.714575 0.133048
C  -1.281742 1.899701 0.925918
C  -4.851414 0.880172 -0.494447
C  1.306348 -0.689531 -0.551494
C  -0.309207 1.1544 0.039384
C  0.351526 0.016278 0.377384
C  1.120994 -2.220672 -0.62686
C  -5.604413 -0.459479 -0.645276
C  1.281272 -2.930621 0.702759
C  3.392393 0.660045 -0.468712
C  0.377369 -3.786362 1.241663
C  4.738934 0.781657 0.214577
H  -3.295162 2.738404 0.925648
H  -2.599554 2.544253 -0.697462
H  -3.546716 0.229377 1.127182
H  -2.845371 0.023156 -0.489415
H  -1.366994 1.390287 1.905977
H  -0.875545 2.914083 1.122867
H  -4.751295 1.363111 -1.488196
H  -5.451422 1.574812 0.128689
H  1.264491 -0.238835 -1.559944
H  -0.128742 1.592379 -0.95565
H  0.203262 -0.443053 1.364692
H  1.871324 -2.610659 -1.344548
H  0.119527 -2.42584 -1.050395
H  -5.743051 -0.948525 0.337587
H  -5.040841 -1.159805 -1.290492
H  -6.603975 -0.315244 -1.095299
H  2.21922 -2.721585 1.236985
H  0.560984 -4.286501 2.199467
H  -0.571303 -4.015406 0.739445
H  5.190627 -0.209445 0.377632
H  4.602786 1.258317 1.202781
H  5.405339 1.415766 -0.389276
