program: Gaussian 09
title: 000115844
version: EM64L-G09RevD.01
frameworkgroup: C1[X(C13H20O2)]
method: RPBEPBE
basis: SDD
operation: Freq
keyword: #pfreq=noraman
keyword: PBEPBE/SDD
title: #p freq=noraman PBEPBE/SDD
converged: YES YES NO NO
title: Mulliken charges:
elementType: O O C C C C C C C C C C C C C H H H H H H H H H H H H H H H H H H H H
charge: -0.260030 -0.251602 -0.081999 -0.091220 -0.203329 -0.199466 -0.524041 -0.580447 -0.549535 -0.477779 -0.477299 -0.041753 -0.348996 0.293105 -0.756189 0.225614 0.223578 0.237414 0.237877 0.226058 0.222188 0.229912 0.209635 0.202136 0.242039 0.204156 0.227064 0.226594 0.204402 0.231385 0.225852 0.237159 0.246519 0.246356 0.244644
chargesum: 0.00000
title: Mulliken charges with hydrogens summed into heavy atoms:
elementType: O O C C C C C C C C C C C C C
charge: -0.260030 -0.251602 0.143615 0.132357 0.034086 0.038411 -0.075794 -0.140901 -0.105360 -0.046559 -0.046304 0.189632 0.114015 0.293105 -0.018670
polarizability: 1.72505189e+02 -1.32706236e+00 1.26272747e+02 -2.04771558e+00 -3.02656326e+00 1.12809810e+02
1716.lowfreq: -38.1227 -15.3690 -0.0005 -0.0004 -0.0003 3.2690 12.4506 25.7443 45.3910
frequency: -38.0962 24.1508 45.3485 56.3837 104.6506 139.2945 175.2463 216.0566 232.5201 261.7950 281.6141 335.2584 392.3507 411.4627 455.0451 493.6274 524.6131 543.6922 567.1867 622.5239 666.1297 729.7343 749.6586 781.3840 815.0297 828.7737 853.4921 861.4328 884.7821 891.0764 905.8085 920.4343 933.7265 940.6310 945.5365 961.7091 1000.7100 1002.1567 1024.7236 1034.4379 1041.5275 1042.9246 1046.0297 1057.0403 1091.3547 1108.4983 1121.9181 1136.5141 1141.2517 1173.3229 1176.5819 1185.2537 1202.0299 1206.8251 1215.5498 1240.6320 1252.6002 1260.2228 1263.8328 1269.6728 1276.8860 1288.7466 1292.2619 1298.2880 1310.1558 1325.4663 1328.4506 1343.7030 1371.3638 1382.4369 1453.6781 1454.4544 1464.8019 1467.6596 1468.8679 1470.6247 1481.9001 1493.0181 1646.4108 2968.9605 2972.6237 2986.8568 2990.6335 2991.6631 2994.2611 3005.3422 3007.5008 3007.5545 3009.9223 3042.2551 3047.7411 3048.4397 3057.6383 3059.1684 3067.0028 3071.1398 3074.9840 3094.7809 3144.2878
redmass: 1.0357 6.1446 3.9663 3.7746 3.4608 2.5736 4.2412 4.9966 2.7763 1.8595 2.6330 2.8653 2.8433 1.8612 2.5730 2.4428 3.8317 3.1740 2.9980 4.2069 2.3167 4.1873 2.8236 2.8692 1.5074 4.5417 2.5100 2.8532 2.5745 1.8377 1.6241 3.0489 2.8925 1.9449 2.3565 1.6684 2.1007 1.7932 1.7351 1.4563 1.6657 1.4877 1.7844 1.9282 2.1236 1.1776 1.8277 1.7713 1.5091 1.5178 1.4584 1.7183 1.5811 3.4134 1.2895 1.4056 1.3979 1.3636 1.3393 1.4288 1.4244 1.2661 1.4516 1.4613 1.4252 1.4302 1.5643 1.4200 1.5697 1.3122 1.0643 1.0471 1.0947 1.0826 1.0858 1.0831 1.0907 1.0950 9.1674 1.0651 1.0710 1.0729 1.0668 1.0750 1.0636 1.0618 1.0373 1.0641 1.0820 1.0970 1.0949 1.0996 1.0925 1.1052 1.1022 1.1012 1.1043 1.0973 1.1009
irintensity: 1.1272 0.5287 1.3880 0.4205 0.3656 0.9081 6.7192 4.1283 3.4727 0.1177 0.5190 1.5297 2.7055 3.1840 1.5768 0.2667 0.6571 6.3258 2.5366 2.9631 1.5946 0.8256 0.5641 1.4333 3.9623 15.9551 3.9103 3.0231 1.9906 0.1692 3.0780 3.1513 26.1407 11.9821 7.0327 0.1616 122.9839 0.6501 5.6938 1.4049 9.4724 0.3067 2.4798 1.9847 2.4934 0.0566 16.1173 7.0554 4.0214 0.4901 1.3547 7.1807 1.7954 400.7068 3.2382 1.7779 5.8980 1.3893 2.8043 0.6535 0.0782 0.8665 5.3718 1.5403 0.9715 1.9248 0.4548 1.3253 8.6670 46.6756 28.5587 18.2684 3.6922 4.7018 0.9114 5.9784 27.2678 11.1484 208.1285 21.0612 10.5159 11.4793 13.2562 18.9530 34.0206 89.6452 2.6563 54.5652 18.8717 38.9003 47.0392 36.0196 6.2977 47.0702 10.4885 127.5838 46.8213 9.0823 12.2434
temp: 298.150 k
press: 1.00000 atm
elementType: 8 8 6 6 6 6 6 6 6 6 6 6 6 6 6 1 1 1 1 1 1 1 1 1 1 1 1 1 1 1 1 1 1 1 1
symmnumber: 1
zpe: 802154.1 jmol-1
zpe.correction: 0.305524 hartree
zpe.thermalcorrener: 0.318846 hartree
zpe.thermalcorrenthalpy: 0.319790 hartree
zpe.thermalcorrgfe: 0.264191 hartree
zpe.sumelectzpe: -656.663609 hartree
zpe.sumelectthermal: -656.650287 hartree
zpe.sumelectthermalent: -656.649343 hartree
zpe.sumelectthermalfe: -656.704942 hartree
dipole: 1.6579 1.2659 -1.2026
dipole: 2.4078
quadrupole: -96.2959 -91.0614 -91.0981
quadrupole: -9.6571 6.6562 2.3870
quadrupole: -3.4774 1.7571 1.7203 -9.6571 6.6562 2.3870
hfenergy: -656.9691329 hartree
pointgroup: C01 [X(C13H20O2)]
dipole: -0.6579913 0.4728594 0.4907391 debye
polarizability: 172.4910825|1.7906865|126.0318441|-1.8196631|3.552507|113.0648193 unknown
InChI: InChI=1S/C13H20O2/c1-8(14)15-7-9-4-12-10-2-3-11(6-10)13(12)5-9/h9-13H,2-7H2,1H3
charge 0 multiplicity 1
35 atoms
O  2.997154 0.282598 0.346047
O  4.621338 -0.832383 -0.900068
C  -1.754142 -0.774654 0.700419
C  -1.463253 0.778593 0.529478
C  -2.924479 -1.022843 -0.299776
C  -2.509855 1.213543 -0.541468
C  -2.579232 -0.042716 -1.460354
C  -0.414311 -1.49368 0.376459
C  0.028529 0.8824 0.107162
C  -4.208598 -0.35785 0.286201
C  -3.922278 1.183481 0.119785
C  0.683069 -0.42248 0.633019
C  2.013396 -0.783966 -0.019468
C  4.287631 0.130106 -0.171091
C  5.175492 1.271739 0.276255
H  -2.069861 -1.018034 1.732572
H  -1.627596 1.328568 1.475424
H  -3.05512 -2.082548 -0.578638
H  -2.266963 2.168072 -1.038818
H  -1.627212 -0.274219 -1.970045
H  -3.378505 0.022529 -2.220683
H  -0.26682 -2.406486 0.981478
H  -0.389953 -1.798891 -0.690297
H  0.115416 0.910519 -0.998684
H  0.524244 1.787329 0.497475
H  -4.376348 -0.646095 1.340121
H  -5.103563 -0.660519 -0.28764
H  -4.673631 1.658728 -0.537075
H  -3.934973 1.722677 1.084714
H  0.843422 -0.328205 1.726364
H  1.93595 -0.825737 -1.122976
H  2.409523 -1.753979 0.334866
H  5.225426 1.304781 1.378487
H  4.754151 2.23492 -0.06032
H  6.184851 1.141201 -0.138727
