program: Gaussian 09
title: 000115839
version: EM64L-G09RevD.01
frameworkgroup: C1[X(C15H28O)]
method: RPBEPBE
basis: SDD
operation: Freq
keyword: #pfreq=noraman
keyword: PBEPBE/SDD
title: #p freq=noraman PBEPBE/SDD
converged: YES YES NO NO
title: Mulliken charges:
elementType: O C C C C C C C C C C C C C C C H H H H H H H H H H H H H H H H H H H H H H H H H H H H
charge: -0.475470 -0.371751 -0.417805 -0.025617 -0.557189 -0.454607 0.241760 0.422895 -0.434599 -0.341435 -0.716734 -0.715565 -0.737238 -0.839047 -0.117974 -0.574446 0.212724 0.186396 0.212171 0.210775 0.195394 0.204578 0.200189 0.211997 0.200747 0.219767 0.222628 0.213153 0.209476 0.210400 0.212202 0.211185 0.209298 0.212212 0.215972 0.201229 0.248921 0.230985 0.227814 0.219860 0.221530 0.331221 0.205163 0.256836
chargesum: 0.00000
title: Mulliken charges with hydrogens summed into heavy atoms:
elementType: O C C C C C C C C C C C C C C C
charge: -0.144250 0.027369 0.005141 0.169778 -0.152421 -0.041863 0.241760 0.422895 0.007795 -0.128282 -0.084656 -0.082870 -0.071116 -0.160389 0.103556 -0.112447
polarizability: 1.99600433e+02 3.82098815e+00 1.60571117e+02 -8.13552544e+00 3.84737048e+00 1.46400073e+02
1716.lowfreq: -9.6181 -8.7200 -0.0009 -0.0009 -0.0007 4.0977 12.7810 18.4957 23.7655
frequency: 10.1921 17.7929 23.1537 42.8827 56.6197 73.2542 89.8768 107.7144 115.7461 140.7300 165.2255 195.9265 207.2506 228.2089 231.5032 236.8460 262.2755 266.6008 277.8802 302.4712 317.5285 327.5591 354.0349 369.8122 383.5322 403.4737 439.1138 460.5697 506.2288 547.8127 555.9167 576.1695 686.0794 719.4081 742.5185 755.3880 775.8572 793.2526 839.5303 879.5139 886.0333 910.5780 914.7159 933.6958 954.1208 955.7421 970.9614 976.0191 980.6083 998.5480 1004.7514 1015.6967 1027.9220 1037.7098 1047.0369 1074.4271 1086.4142 1115.9396 1122.4718 1133.6212 1156.7645 1172.2691 1189.0124 1193.1932 1213.2220 1227.5582 1255.3192 1274.1514 1282.2620 1290.7030 1291.5975 1318.3962 1326.4185 1331.9061 1335.1087 1340.9422 1365.1223 1369.4373 1375.9516 1379.5908 1393.5217 1396.9734 1414.9260 1451.6973 1453.2765 1458.9850 1462.5876 1463.7567 1465.1591 1470.6613 1472.1555 1474.6489 1479.5387 1483.6208 1485.4934 1489.8546 1659.0975 1685.9753 2944.5903 2946.7171 2955.3858 2963.6809 2963.8579 2967.2204 2970.5793 2971.8470 2979.4479 2981.2025 3003.2870 3012.5314 3018.2794 3031.2169 3041.3851 3048.5500 3061.5694 3062.6969 3063.2416 3066.8071 3067.3047 3068.8753 3083.7293 3091.5932 3095.3999 3108.8943 3217.6329 3559.2642
redmass: 3.2899 2.9883 3.7777 3.5230 2.8935 2.8566 3.0021 2.1479 2.4748 1.1268 3.2919 2.6342 1.1589 1.1169 1.4901 1.2402 1.5669 2.2034 2.2235 1.9309 2.1179 2.3447 2.0592 2.5243 2.1423 2.4522 2.9480 2.6259 2.6518 2.5299 2.5444 2.4082 1.9162 2.7486 1.8553 1.5452 1.9338 1.8438 1.6186 1.7404 2.0874 1.2859 1.6293 1.6521 1.4921 1.3931 1.8929 1.6397 1.8118 1.1085 1.4059 1.8725 2.4071 1.5374 1.9262 1.6740 2.4178 1.4435 1.8467 2.1215 1.8779 2.1908 1.5680 1.7853 1.4176 1.6948 1.3154 1.2412 1.2762 1.3125 1.2908 1.5064 1.5239 1.4247 1.4161 1.4380 1.3819 1.4349 1.2184 1.2142 1.2195 1.2868 1.2332 1.0805 1.0839 1.0792 1.0712 1.0450 1.0602 1.0622 1.0823 1.0555 1.0803 1.0549 1.0710 1.0624 5.2195 6.8698 1.0616 1.0695 1.0614 1.0687 1.0392 1.0351 1.0378 1.0422 1.0658 1.0595 1.0981 1.0982 1.0950 1.0965 1.1023 1.0902 1.0998 1.0997 1.0967 1.0989 1.0948 1.0985 1.0773 1.0952 1.0987 1.0756 1.1146 1.0658
irintensity: 0.2066 0.3348 0.0997 0.0446 0.2270 0.1053 1.4630 0.0727 0.4286 1.1033 4.3595 6.4116 0.5383 10.1417 0.2316 0.0504 47.9302 19.9640 32.9328 38.9899 36.6118 3.7730 0.1031 1.3052 0.0780 2.7129 1.8962 3.4425 0.2253 2.3053 6.0262 14.2844 17.5575 1.6743 6.8087 2.3686 0.6861 3.7686 4.0554 25.9460 26.6709 1.9920 2.4227 1.7826 12.6305 55.4515 8.2493 0.7553 4.3026 37.6708 30.5579 3.2555 5.0242 4.0354 5.5167 0.7979 5.6492 7.3341 1.3854 20.7981 30.3441 64.6393 3.0225 9.6369 8.4843 3.5201 12.6329 3.9086 2.1009 1.1766 8.1503 1.2631 2.2608 2.0117 1.7180 4.5596 0.6888 1.5744 21.6914 17.8977 15.4142 24.1223 24.4943 0.2121 4.4136 5.1231 7.0892 1.8535 11.7247 9.9428 6.4109 1.5626 7.8381 16.9286 9.9155 19.4191 7.5512 1.7296 28.3251 27.5451 25.6294 50.6010 27.9436 42.9325 38.8225 5.8650 15.7300 52.3902 6.6547 28.4716 14.5979 31.0570 74.0556 8.8547 9.3984 22.9814 9.7140 74.8339 77.6547 110.2674 11.6338 39.8519 28.3100 15.6317 11.1977 5.3496
temp: 298.150 k
press: 1.00000 atm
elementType: 8 6 6 6 6 6 6 6 6 6 6 6 6 6 6 6 1 1 1 1 1 1 1 1 1 1 1 1 1 1 1 1 1 1 1 1 1 1 1 1 1 1 1 1
symmnumber: 1
zpe: 1030762.9 jmol-1
zpe.correction: 0.392597 hartree
zpe.thermalcorrener: 0.413719 hartree
zpe.thermalcorrenthalpy: 0.414663 hartree
zpe.thermalcorrgfe: 0.339756 hartree
zpe.sumelectzpe: -662.260485 hartree
zpe.sumelectthermal: -662.239364 hartree
zpe.sumelectthermalent: -662.238419 hartree
zpe.sumelectthermalfe: -662.313327 hartree
dipole: -0.0944 -1.7806 0.3469
dipole: 1.8166
quadrupole: -104.3267 -102.1859 -98.0323
quadrupole: -7.3406 0.9618 3.9220
quadrupole: -2.8117 -0.6709 3.4826 -7.3406 0.9618 3.9220
hfenergy: -662.6530823 hartree
pointgroup: C01 [X(C15H28O1)]
dipole: 0.0401088 -0.7086835 -0.0832871 debye
polarizability: 199.6237474|-4.2574038|159.8744519|-7.8500684|-4.899229|147.0734241 unknown
InChI: InChI=1S/C15H28O/c1-6-15(5,16)12-8-11-14(4)10-7-9-13(2)3/h6,11,13,16H,1,7-10,12H2,2-5H3
charge 0 multiplicity 1
44 atoms
O  -4.068604 0.573038 1.604377
C  3.495003 0.03476 0.688352
C  3.39913 -0.929061 -0.516598
C  4.814955 0.851787 0.796858
C  2.037339 -1.679614 -0.584202
C  -2.731195 -0.903021 0.110705
C  -4.079147 -0.142426 0.305677
C  0.818105 -0.776876 -0.766734
C  -1.480211 0.012068 0.142614
C  -0.193453 -0.78621 0.150663
C  4.998472 1.831164 -0.388788
C  6.059822 -0.054324 0.962381
C  -5.265865 -1.141106 0.282779
C  0.829186 0.087736 -2.016561
C  -4.274094 0.908424 -0.775155
C  -4.476321 2.229475 -0.559918
H  2.639926 0.740143 0.648872
H  3.36278 -0.554728 1.620483
H  4.207176 -1.684641 -0.459588
H  3.55834 -0.373532 -1.461285
H  4.727659 1.465328 1.719447
H  1.913791 -2.281859 0.337908
H  2.083995 -2.396553 -1.432485
H  -2.761457 -1.45509 -0.849647
H  -2.646652 -1.671366 0.909242
H  -1.543351 0.635524 1.057986
H  -1.518568 0.715527 -0.707387
H  -0.078921 -1.461958 1.015267
H  5.151141 1.288946 -1.340826
H  5.880984 2.479196 -0.231381
H  4.113165 2.484354 -0.507309
H  5.934426 -0.758138 1.807073
H  6.964992 0.551545 1.155899
H  6.248417 -0.649976 0.049579
H  -5.361355 -1.628666 -0.704506
H  -5.122612 -1.938507 1.038793
H  -6.206954 -0.608068 0.50083
H  1.597473 0.883407 -1.945766
H  -0.139273 0.57959 -2.203007
H  1.083747 -0.519401 -2.907681
H  -4.251503 0.508399 -1.800308
H  -4.021267 -0.104586 2.325896
H  -4.623209 2.926628 -1.392876
H  -4.49651 2.628768 0.458429
