program: Gaussian 09
title: 000115831
version: EM64L-G09RevD.01
frameworkgroup: C1[X(C16H28O)]
method: RPBEPBE
basis: SDD
operation: Freq
keyword: #pfreq=noraman
keyword: PBEPBE/SDD
title: #p freq=noraman PBEPBE/SDD
converged: NO YES NO NO
title: Mulliken charges:
elementType: O C C C C C C C C C C C C C C C C H H H H H H H H H H H H H H H H H H H H H H H H H H H H
charge: -0.487737 0.425879 0.334020 -0.579467 0.301124 0.007475 -0.508695 -0.482430 -0.823861 -0.516010 -0.550276 -0.770067 -0.772732 -0.791323 -0.502264 -0.238304 -0.216040 0.194432 0.243645 0.184629 0.250815 0.188434 0.189556 0.191766 0.228782 0.228277 0.205030 0.238259 0.214052 0.226714 0.250273 0.209369 0.214637 0.209621 0.204672 0.212232 0.218240 0.218767 0.210662 0.221379 0.234149 0.220301 0.345336 0.206628 0.210052
chargesum: 0.00000
title: Mulliken charges with hydrogens summed into heavy atoms:
elementType: O C C C C C C C C C C C C C C C C
charge: -0.142401 0.425879 0.334020 -0.141390 0.301124 0.195909 -0.073252 -0.101107 -0.161772 -0.063699 -0.073289 -0.136440 -0.137588 -0.140516 -0.047814 -0.031676 -0.005988
polarizability: 2.03148889e+02 -3.86241169e+00 1.61442337e+02 -2.16249704e+00 2.22697212e+00 1.40959452e+02
1716.lowfreq: -20.8021 0.0004 0.0007 0.0008 7.6769 13.2967 54.7033 58.9232 102.6867
frequency: 54.6596 58.6970 102.6311 118.9737 136.3171 171.9147 185.3414 194.5396 218.7864 226.0137 236.0052 257.4112 259.5783 276.9513 289.0374 305.5250 316.6256 326.3019 342.7299 370.6258 378.7246 399.1699 413.8993 418.4909 453.3984 477.0688 486.1960 495.6055 518.8232 541.7634 613.9803 663.2280 675.3795 696.5590 764.3859 777.3586 827.9194 840.3490 856.4213 869.6800 897.7179 914.3905 923.4852 926.9909 927.9971 939.9011 954.5106 959.5642 969.2030 974.8570 984.7498 992.5067 1035.9057 1040.5580 1051.7873 1060.6532 1071.6079 1085.8940 1104.8450 1115.1032 1128.5231 1159.0473 1171.0565 1188.7972 1198.9055 1205.7986 1208.9004 1216.6904 1237.8740 1256.5332 1275.0261 1284.2641 1298.5167 1310.7916 1319.6986 1325.8297 1335.2416 1339.6137 1348.9481 1354.4844 1355.7201 1371.9079 1381.3402 1382.9666 1392.1259 1395.3249 1441.2791 1454.8004 1457.6495 1462.3409 1464.2985 1464.8143 1466.5580 1472.2843 1477.4583 1481.9238 1484.2112 1486.8445 1494.0747 1503.8366 1667.4448 2938.1041 2958.0826 2961.8651 2963.4003 2964.5568 2971.3898 2976.3658 2977.2883 2978.8916 2984.1907 2998.3422 3011.2801 3016.6027 3023.8606 3033.3575 3048.9198 3053.9969 3057.8223 3061.7621 3066.9383 3068.7211 3071.4277 3072.6732 3079.9691 3093.3742 3099.6344 3125.2192 3532.8694
redmass: 3.1244 3.2096 2.9555 2.9073 1.8912 1.0874 1.7571 1.6465 1.1837 2.7655 2.1039 1.5910 2.3194 2.4911 2.5164 2.5345 2.3186 2.4254 2.2080 1.6301 2.2208 2.8871 2.0153 1.3526 2.4458 2.7087 2.3876 3.0434 2.7536 3.9750 3.8116 1.2035 2.8596 2.8520 1.7553 2.9521 2.4355 1.9175 2.3149 3.1836 1.7776 2.0064 1.9915 1.5340 1.4909 2.0304 2.0493 1.8249 1.6116 1.2109 1.5874 1.7863 1.9919 1.9195 1.5670 1.7817 1.7348 2.4908 1.9266 1.9680 1.7888 2.0996 1.1042 1.8073 1.6800 1.4965 2.0784 1.7010 2.5167 1.3629 1.7247 1.4902 1.3604 1.4080 1.3215 1.4837 1.5409 1.5802 1.5694 1.3531 1.5519 1.2032 1.5288 1.2408 1.2170 1.1998 1.0907 1.0673 1.0790 1.0621 1.0744 1.0723 1.0703 1.0594 1.0810 1.0580 1.0587 1.0553 1.0565 1.0544 6.1911 1.0820 1.0580 1.0597 1.0632 1.0371 1.0365 1.0593 1.0408 1.0566 1.0447 1.0697 1.0996 1.0863 1.0998 1.0968 1.0994 1.0993 1.0987 1.0989 1.0983 1.0983 1.1006 1.0981 1.0973 1.0840 1.0934 1.0993 1.0655
irintensity: 0.5812 0.2082 0.0991 0.4557 0.0957 0.0489 1.1319 1.8373 0.0221 3.0694 0.3113 0.1958 0.8964 3.7397 0.3413 3.8659 1.3564 2.5267 11.6841 14.6307 3.0368 2.6374 1.5250 40.1400 2.5573 5.3507 1.4309 3.7097 1.8873 1.7717 3.1851 45.1342 2.8019 2.0090 8.5273 6.8279 9.2784 3.6210 13.3837 6.6661 1.5531 1.0971 0.8868 6.7665 0.2371 5.3445 10.9863 7.9791 8.1685 2.0695 15.9398 12.9718 2.5750 0.1145 17.8721 11.1524 7.8428 1.1325 3.2670 7.6947 5.2053 9.8406 6.9307 5.1283 1.5067 4.3439 12.4471 19.1619 7.1341 4.1040 1.5399 18.4027 0.1224 5.4416 6.2122 2.7268 3.9766 8.1336 8.1932 22.2511 26.1233 13.9669 1.3476 18.8368 23.9796 20.0993 4.8951 1.0282 4.1893 0.6849 7.9958 17.7911 5.2723 8.3428 4.2040 13.1169 11.1826 11.8027 5.8879 16.0805 4.9591 16.5532 22.7745 36.7668 31.6871 53.3105 38.1418 12.4746 48.4949 25.3370 39.1048 13.3713 41.4940 37.3597 15.4015 15.5020 19.2849 2.8240 112.5352 6.3736 42.9523 75.9215 17.0751 28.0850 67.6425 7.1055 32.7587 65.6515 2.8937
temp: 298.150 k
press: 1.00000 atm
elementType: 8 6 6 6 6 6 6 6 6 6 6 6 6 6 6 6 6 1 1 1 1 1 1 1 1 1 1 1 1 1 1 1 1 1 1 1 1 1 1 1 1 1 1 1 1
symmnumber: 1
zpe: 1061470.1 jmol-1
zpe.correction: 0.404293 hartree
zpe.thermalcorrener: 0.422652 hartree
zpe.thermalcorrenthalpy: 0.423596 hartree
zpe.thermalcorrgfe: 0.360773 hartree
zpe.sumelectzpe: -700.333625 hartree
zpe.sumelectthermal: -700.315266 hartree
zpe.sumelectthermalent: -700.314322 hartree
zpe.sumelectthermalfe: -700.377145 hartree
dipole: 1.4852 0.3528 0.7122
dipole: 1.6845
quadrupole: -102.7721 -105.5665 -109.3867
quadrupole: 0.3553 -1.3335 -0.5490
quadrupole: 3.1363 0.3419 -3.4782 0.3553 -1.3335 -0.5490
hfenergy: -700.7379179 hartree
pointgroup: C01 [X(C16H28O1)]
dipole: 0.5906703 -0.150601 -0.260064 debye
polarizability: 202.9693599|4.4429661|161.7414719|2.9809769|0.9473666|140.8398462 unknown
InChI: InChI=1S/C16H28O/c1-13-8-11-15(4,12-14(13,2)3)16(17)9-6-5-7-10-16/h5-6,13,17H,7-12H2,1-4H3
charge 0 multiplicity 1
45 atoms
O  1.375002 0.210789 1.546435
C  0.012014 0.260839 -0.491479
C  -2.423828 -0.802956 0.031953
C  -0.859998 -0.910866 0.073353
C  1.491097 0.081906 0.061401
C  -2.857023 0.604558 0.577405
C  -0.56352 1.619922 0.022599
C  -2.093045 1.741368 -0.144987
C  0.036007 0.261559 -2.045294
C  2.485125 1.169524 -0.442768
C  2.102126 -1.316562 -0.244217
C  -2.955959 -1.922153 0.974021
C  -3.002923 -1.077352 -1.38574
C  -4.381231 0.85931 0.529256
C  3.839477 1.097286 0.30339
C  3.565447 -1.41109 0.161268
C  4.345068 -0.328102 0.429042
H  -0.581402 -1.855177 -0.438597
H  -0.571167 -1.021983 1.137092
H  -0.074381 2.458692 -0.5114
H  -0.308853 1.721963 1.093748
H  -2.541377 0.631886 1.644603
H  -2.422289 2.716017 0.268855
H  -2.372964 1.757872 -1.218598
H  -0.965106 0.475769 -2.451408
H  0.715539 1.03723 -2.441529
H  0.350037 -0.715852 -2.457054
H  2.048756 2.175325 -0.313665
H  2.67078 1.017812 -1.52271
H  2.00106 -1.552959 -1.322264
H  1.526874 -2.090813 0.297401
H  -4.060018 -1.974908 0.965929
H  -2.627644 -1.752057 2.017068
H  -2.573749 -2.911623 0.656162
H  -2.53249 -1.97718 -1.826098
H  -2.845365 -0.239846 -2.086743
H  -4.091819 -1.262452 -1.334709
H  -4.954231 0.078763 1.061585
H  -4.621976 1.829927 1.002994
H  -4.749138 0.900168 -0.513113
H  3.747734 1.557078 1.309652
H  4.591199 1.709431 -0.232804
H  2.209468 -0.154411 1.940174
H  3.990912 -2.420218 0.252166
H  5.387174 -0.473735 0.745726
