program: Gaussian 09
title: 000115829
version: EM64L-G09RevD.01
frameworkgroup: C1[X(C8H17N5O2)]
method: RPBEPBE
basis: SDD
operation: Freq
keyword: #p
keyword: freq=noraman
keyword: PBEPBE/SDD
title: #p freq=noraman PBEPBE/SDD
converged: YES YES NO NO
title: Mulliken charges:
elementType: O O N N N N N C C C C C C C C H H H H H H H H H H H H H H H H H
charge: -0.179937 -0.186549 -0.554897 -0.404117 -0.124288 -0.634283 -0.658205 -0.397510 -0.261585 -0.368258 -0.462472 0.203072 0.258578 0.215569 -0.800698 0.204358 0.232506 0.219547 0.189811 0.231477 0.193748 0.207148 0.276036 0.277174 0.323688 0.239339 0.268794 0.237266 0.312794 0.293378 0.310268 0.338250
chargesum: 0.00000
title: Mulliken charges with hydrogens summed into heavy atoms:
elementType: O O N N N N N C C C C C C C C
charge: -0.179937 -0.186549 -0.001687 -0.080429 -0.124288 -0.028110 -0.009687 0.039354 -0.042038 0.053029 -0.061576 0.203072 0.258578 0.215569 -0.055300
polarizability: 1.53517627e+02 5.67517010e+00 1.49104912e+02 2.99155913e+00 6.01030603e+00 9.49566323e+01
1716.lowfreq: -7.8803 -4.7074 -0.0009 -0.0007 -0.0004 2.8003 17.5405 26.3965 32.3873
frequency: 17.4819 26.3824 32.3803 37.5153 47.8081 59.8649 94.6961 103.1482 145.3325 155.6168 170.6825 189.3266 203.7854 248.8457 277.6878 313.7937 320.6328 355.2043 371.0640 397.5191 428.8456 434.2543 468.6689 488.7652 540.4460 545.9461 563.9645 574.2230 673.8845 677.0759 678.5578 721.2111 762.4199 777.5871 849.7206 870.4117 888.5509 895.7879 944.8493 967.1186 996.4957 1018.9468 1031.1873 1033.2452 1043.9492 1087.4242 1122.3199 1140.4321 1152.1261 1176.8356 1202.1470 1210.7538 1247.2111 1253.0463 1296.8218 1304.4136 1346.5602 1358.6822 1359.5234 1374.9847 1410.3459 1424.2227 1456.2853 1456.8895 1459.2295 1467.0625 1474.4063 1600.5677 1614.8941 1646.1438 1656.1145 1667.7664 1682.2142 2874.5103 2918.8648 2963.6668 2974.8869 2986.8322 2992.9648 3035.3544 3067.3366 3072.6041 3135.2032 3423.8260 3500.8981 3525.7461 3539.6094 3552.7039 3674.7386 3697.6152
redmass: 3.9652 4.8701 2.8813 2.6102 1.6746 4.9857 3.6533 2.9465 3.0768 3.7219 3.6914 1.2616 3.0402 4.5673 2.1193 3.0872 3.9838 1.2483 3.7400 1.3137 1.3806 1.5723 2.3792 2.8220 3.9074 1.5139 2.2235 2.8171 3.2463 1.4496 2.6312 2.5262 1.3791 3.2651 2.7492 5.0160 2.0638 3.0778 2.5022 2.7461 2.2799 1.5334 1.4504 1.7116 1.9452 2.2138 3.1432 1.4593 2.5172 2.1336 2.9097 1.2906 1.3303 1.5677 1.2276 1.2747 1.4063 1.3135 1.4830 1.2345 4.2818 1.6026 1.0860 1.0820 1.1606 1.0474 1.0982 1.2389 1.2959 4.2170 1.1153 3.4363 9.4821 1.0552 1.1014 1.0743 1.0717 1.0380 1.0635 1.0957 1.1014 1.0981 1.0984 1.0457 1.0765 1.0451 1.0947 1.0454 1.1016 1.1029
irintensity: 7.1630 1.2841 3.2280 4.8432 4.7287 0.8482 4.0243 2.3402 6.1374 3.4003 0.8480 44.5284 9.7451 4.5918 5.4755 32.3474 6.1759 78.2519 4.4175 149.5247 159.6177 6.8777 16.7940 11.1496 8.0212 224.7918 52.6470 1.0705 54.2526 83.4579 54.4589 99.9949 6.3409 152.0050 13.5530 11.2001 0.1404 0.3357 15.8113 6.5637 15.6265 3.3758 7.9193 9.5352 0.4752 10.0021 90.5059 1.6378 34.7875 5.4726 181.2103 28.4195 6.2372 8.1970 4.2310 5.2047 41.7598 7.5595 9.2833 61.4820 95.9758 488.2860 4.4319 23.8873 85.8864 19.6647 31.4564 134.8373 94.7022 11.2852 48.9374 592.0586 233.5428 78.7121 55.2828 6.3275 25.5462 6.0384 63.4942 7.6233 52.0347 14.0704 9.5501 1.5124 9.8447 17.5532 2.1566 20.2086 18.6660 20.7393
temp: 298.150 k
press: 1.00000 atm
elementType: 8 8 7 7 7 7 7 6 6 6 6 6 6 6 6 1 1 1 1 1 1 1 1 1 1 1 1 1 1 1 1 1
symmnumber: 1
zpe: 694023.5 jmol-1
zpe.correction: 0.264340 hartree
zpe.thermalcorrener: 0.282799 hartree
zpe.thermalcorrenthalpy: 0.283743 hartree
zpe.thermalcorrgfe: 0.214346 hartree
zpe.sumelectzpe: -738.072332 hartree
zpe.sumelectthermal: -738.053874 hartree
zpe.sumelectthermalent: -738.052929 hartree
zpe.sumelectthermalfe: -738.122327 hartree
dipole: 7.3680 2.5367 2.4035
dipole: 8.1547
quadrupole: -91.8047 -79.1979 -92.2736
quadrupole: 3.0906 -21.5122 3.5737
quadrupole: -4.0459 8.5608 -4.5149 3.0906 -21.5122 3.5737
hfenergy: -738.336672 hartree
pointgroup: C01 [X(C8H17N5O2)]
dipole: 2.6993248 -0.9847455 -1.4272584 debye
polarizability: 151.6699718|-4.2184948|141.2016727|-5.7795539|21.9488429|104.7075275 unknown
InChI: InChI=1S/C8H17N5O2/c1-5(14)13-7(15)6(9)3-2-4-12-8(10)11/h6,13H,2-4,9-11H2,1H3
charge 0 multiplicity 1
32 atoms
O  -3.049002 1.473655 1.457213
O  -4.487646 -0.946656 0.618986
N  -1.05805 3.324678 0.644867
N  -2.556054 0.018313 -0.339955
N  2.581117 -0.365414 -0.481691
N  3.548917 -2.361609 -1.267171
N  4.860443 -0.975728 0.099601
C  0.214894 1.19846 0.438304
C  -1.072713 1.979372 0.055072
C  1.491201 1.82534 -0.154243
C  2.737231 0.967622 0.143933
C  -2.330758 1.155599 0.480818
C  -3.579072 -0.966182 -0.241802
C  3.616886 -1.171734 -0.522692
C  -3.449504 -2.055822 -1.309276
H  0.288277 1.1630 1.545479
H  0.162753 0.149224 0.090187
H  -1.088402 2.090116 -1.04997
H  1.38449 1.907718 -1.254312
H  1.620424 2.848705 0.243119
H  2.850235 0.88322 1.25189
H  3.641897 1.501885 -0.233636
H  -1.114293 3.279323 1.671304
H  -1.812359 3.92445 0.288382
H  -1.869506 -0.125646 -1.087259
H  -2.48453 -2.588585 -1.218231
H  -4.268438 -2.777671 -1.179107
H  -3.509245 -1.627205 -2.327134
H  2.676978 -2.496403 -1.776006
H  4.027126 -3.193625 -0.923776
H  5.694657 -1.438139 -0.254519
H  4.980344 -0.191461 0.733723
