program: Gaussian 09
title: 000115818
version: EM64L-G09RevD.01
frameworkgroup: C1[X(C17H30O4)]
method: RPBEPBE
basis: SDD
operation: Freq
keyword: #pfreq=noraman
keyword: PBEPBE/SDD
title: #p freq=noraman PBEPBE/SDD
converged: YES YES NO NO
title: Mulliken charges:
elementType: O O O O C C C C C C C C C C C C C C C C C H H H H H H H H H H H H H H H H H H H H H H H H H H H H H H
charge: -0.276134 -0.228009 -0.412276 -0.232567 -0.378552 -0.436896 -0.385416 -0.145315 -0.377884 -0.379500 -0.542313 -0.458437 0.196621 -0.201806 0.176712 -0.447958 -0.199702 -0.346161 -0.346898 -0.694459 -0.499079 0.206277 0.203434 0.212433 0.239106 0.194030 0.196014 0.273618 0.195022 0.194209 0.195337 0.209517 0.265605 0.277898 0.204968 0.196656 0.224301 0.191949 0.202162 0.224041 0.188085 0.204126 0.195710 0.192402 0.209284 0.210541 0.215175 0.231986 0.241512 0.242415 0.378220
chargesum: 0.00000
title: Mulliken charges with hydrogens summed into heavy atoms:
elementType: O O O O C C C C C C C C C C C C C C C C C
charge: -0.276134 -0.228009 -0.034057 -0.232567 0.031158 0.014643 0.004628 0.128302 0.011347 0.025353 0.001189 -0.056812 0.196621 0.022495 0.176712 -0.053847 0.024339 0.046050 0.041214 -0.059459 0.216834
polarizability: 2.43138848e+02 -5.95953600e+00 1.86248662e+02 -3.99998832e+00 3.44557863e+00 1.72961313e+02
1716.lowfreq: -16.1874 -7.9834 -5.4505 -3.2061 -0.0008 0.0004 0.0009 7.8407 14.4930
frequency: -11.9657 7.0600 13.4936 27.6307 31.0543 39.6922 45.5057 59.7247 62.8021 65.9728 73.7823 89.7420 93.0717 98.9675 120.9900 123.7524 129.8737 157.0922 158.2111 182.4522 194.4671 205.3994 223.5381 248.4844 251.7781 279.8680 299.2286 321.4244 367.8920 389.5171 423.6816 445.6103 475.0469 501.3278 537.1665 546.6981 560.9026 641.8287 658.3114 708.6620 720.0246 726.7157 737.1303 765.2504 776.3009 786.2860 808.9491 859.0108 868.2529 874.7309 889.2350 911.4228 935.7541 968.5615 978.3585 986.5899 1000.1396 1003.1317 1018.9599 1028.7459 1038.4749 1058.7874 1062.9052 1065.8454 1077.1942 1080.4886 1096.5807 1100.6279 1107.6325 1108.0637 1112.2162 1146.1594 1164.1504 1181.1554 1193.3691 1206.6786 1216.3179 1223.7739 1239.4825 1246.0555 1257.8464 1262.1993 1268.2719 1276.4521 1282.8734 1284.8669 1287.7978 1293.8794 1297.9530 1302.0425 1310.4531 1319.6829 1329.0969 1341.0748 1346.5704 1350.0378 1357.8294 1365.1006 1389.4986 1421.7664 1435.2221 1451.1337 1456.6736 1456.9624 1457.2812 1461.4783 1463.8681 1464.9164 1465.2397 1475.3054 1475.3675 1476.1490 1484.9518 1486.1081 1641.8385 1665.3711 1684.7606 2947.3271 2948.0545 2951.2027 2954.2146 2959.6979 2963.4459 2967.4790 2968.4503 2971.4674 2983.6502 2987.2088 2998.5769 2999.3397 3000.5249 3004.1774 3009.1277 3011.0602 3024.3423 3036.5397 3037.2636 3041.8098 3057.4469 3057.8739 3067.2316 3068.9784 3070.3848 3071.5610 3105.6836 3148.3514 3509.9180
redmass: 4.0500 3.4638 4.5739 4.5121 5.6014 3.5468 2.7210 2.0329 2.7293 3.4668 2.9598 1.2818 2.4876 2.7415 2.0147 2.3785 2.3309 2.9815 2.2990 2.9828 2.7364 5.7979 1.1559 3.4851 3.2920 3.0566 3.8497 4.5097 3.5589 3.6928 2.7289 3.3242 3.1569 1.9915 2.7750 2.9261 4.6792 1.3781 3.5395 3.1173 1.1173 1.0799 1.2702 2.6395 1.3585 1.5345 1.6398 1.5068 2.7044 3.4389 1.7212 1.4223 1.6342 1.3487 1.8496 4.7978 1.8622 4.3088 2.6979 3.1360 2.1354 1.4663 2.6309 2.4959 2.1968 2.6684 2.0628 2.1747 2.5009 2.2800 1.2929 1.4288 2.0370 1.8598 1.7280 1.4639 1.3445 1.4594 1.3266 1.3917 1.3093 1.2822 1.2009 1.1863 1.0802 1.1585 1.2555 1.1954 1.2103 1.2211 1.3654 1.2570 1.3925 1.4760 1.5936 1.5959 1.5913 1.8679 1.2164 1.1765 1.0850 1.0504 1.0829 1.0770 1.0870 1.0631 1.0867 1.0580 1.0730 1.1003 1.0691 1.0441 1.1013 1.0800 9.7030 8.2097 6.6128 1.0616 1.0614 1.0592 1.0591 1.0591 1.0601 1.0596 1.0608 1.0364 1.0601 1.0965 1.0957 1.0972 1.0647 1.0295 1.0996 1.0994 1.1020 1.0909 1.1024 1.1010 1.0983 1.0980 1.0924 1.0961 1.0993 1.0943 1.1045 1.1048 1.0639
irintensity: 0.0895 0.1794 0.2229 1.6917 0.0845 0.5233 0.1098 0.0316 0.0623 0.3216 0.0355 0.2483 0.2143 0.3574 0.1281 0.6251 0.0795 2.7495 1.3582 3.8573 0.7288 2.3230 0.0762 2.5977 2.9693 2.7642 3.8758 7.8351 4.9527 1.0869 1.9145 4.9635 1.5704 34.6277 13.8908 20.3827 22.1044 130.0346 0.1615 4.3479 9.8583 9.1325 1.9579 6.8046 2.4256 5.3570 1.2436 4.7653 8.3193 4.7297 2.5869 7.6140 1.1668 41.5421 57.7696 4.0237 16.4222 3.9925 27.5868 74.4499 165.3181 57.1453 8.3623 2.2457 18.9507 12.3516 37.2934 14.5805 11.9735 9.8846 0.4006 14.2830 2.0205 91.2669 27.9850 2.8995 17.0477 20.4645 1.9147 6.0942 2.2170 9.0593 3.6837 3.1170 0.3782 5.7338 9.3526 2.1067 0.6299 6.1779 3.2710 1.0493 1.8451 1.0137 0.3485 1.0161 0.8002 54.6556 11.4526 14.2260 40.7285 14.3945 1.3411 4.7035 1.2688 0.5396 3.5320 10.3709 0.6573 0.1138 5.0710 12.1931 20.5796 16.8888 178.8036 190.1977 0.0113 25.0119 20.9483 3.4975 8.2013 0.9571 0.2343 112.0580 85.1605 43.8083 38.5587 0.1151 6.8693 4.1849 12.6154 33.3666 1.5519 0.9393 2.8839 9.5770 46.6351 84.1467 26.2253 40.6180 23.4897 164.1678 56.5439 9.3693 27.2804 14.7223 24.2537
temp: 298.150 k
press: 1.00000 atm
elementType: 8 8 8 8 6 6 6 6 6 6 6 6 6 6 6 6 6 6 6 6 6 1 1 1 1 1 1 1 1 1 1 1 1 1 1 1 1 1 1 1 1 1 1 1 1 1 1 1 1 1 1
symmnumber: 1
zpe: 1154405.5 jmol-1
zpe.correction: 0.439690 hartree
zpe.thermalcorrener: 0.465683 hartree
zpe.thermalcorrenthalpy: 0.466627 hartree
zpe.thermalcorrgfe: 0.376811 hartree
zpe.sumelectzpe: -965.005638 hartree
zpe.sumelectthermal: -964.979645 hartree
zpe.sumelectthermalent: -964.978701 hartree
zpe.sumelectthermalfe: -965.068517 hartree
dipole: 0.2248 0.2596 2.8658
dipole: 2.8863
quadrupole: -122.7683 -121.2500 -136.1403
quadrupole: -1.9014 11.9939 4.5173
quadrupole: 3.9512 5.4695 -9.4207 -1.9014 11.9939 4.5173
hfenergy: -965.4453276 hartree
pointgroup: C01 [X(C17H30O4)]
dipole: -0.0935359 0.4176699 -1.051804 debye
polarizability: 243.1916062|6.4786915|186.9660734|-2.6763165|0.6794278|172.191143 unknown
InChI: InChI=1S/C17H30O4/c1-3-4-5-6-7-8-9-10-11-12-13-15(14-16(18)19)17(20)21-2/h6-7,15,18H,3-5,8-14H2,1-2H3
charge 0 multiplicity 1
51 atoms
O  -4.43453 2.271262 -0.579373
O  -4.523347 1.941851 1.722615
O  -6.41132 -2.214263 -2.049573
O  -5.089151 -2.790696 -0.232146
C  -1.777275 -0.033842 0.693806
C  -2.897975 -0.331743 -0.326054
C  -0.379394 -0.4341 0.170909
C  -4.328318 -0.010885 0.202006
C  0.753751 -0.129968 1.176311
C  2.151115 -0.54584 0.664856
C  -5.419134 -0.400367 -0.825473
C  3.284498 -0.214157 1.672694
C  -4.445239 1.46528 0.568364
C  4.644961 -0.700247 1.218374
C  -5.580086 -1.902461 -0.962858
C  7.089913 -0.400818 0.543036
C  5.731801 0.086895 1.002711
C  7.554112 0.245739 -0.790238
C  8.976176 -0.194785 -1.205763
C  9.439924 0.442657 -2.5334
C  -4.514891 3.732543 -0.339207
H  -1.774194 1.044948 0.952283
H  -1.986646 -0.577335 1.637802
H  -2.722551 0.242061 -1.257585
H  -2.872011 -1.407297 -0.585246
H  -0.175785 0.097474 -0.782306
H  -0.37487 -1.517672 -0.069923
H  -4.49206 -0.575222 1.138089
H  0.756243 0.95549 1.409226
H  0.544175 -0.651523 2.133733
H  2.156402 -1.635541 0.454167
H  2.364714 -0.040509 -0.298519
H  -6.408253 0.002507 -0.530159
H  -5.203125 0.032971 -1.817728
H  3.315928 0.879892 1.846408
H  3.027852 -0.682674 2.647277
H  4.737133 -1.786226 1.048545
H  7.850673 -0.171284 1.320317
H  7.073787 -1.503495 0.432986
H  5.638815 1.173759 1.166156
H  7.527304 1.351066 -0.691355
H  6.833142 -0.013843 -1.591418
H  9.003416 -1.300126 -1.294654
H  9.68858 0.069141 -0.397236
H  9.4501 1.546781 -2.460589
H  8.760626 0.168671 -3.362625
H  10.458944 0.112888 -2.808002
H  -4.504544 4.183369 -1.341379
H  -3.651084 4.069196 0.258374
H  -5.444182 3.980768 0.200659
H  -6.52502 -3.202491 -2.100897
