program: Gaussian 09
title: 000115806
version: EM64L-G09RevD.01
frameworkgroup: C1[X(C10H15N)]
method: RPBEPBE
basis: SDD
operation: Freq
keyword: #pfreq=noraman
keyword: PBEPBE/SDD
title: #p freq=noraman PBEPBE/SDD
converged: YES YES NO NO
title: Mulliken charges:
elementType: N C C C C C C C C C C H H H H H H H H H H H H H H H
charge: -0.594327 -0.575091 -0.064658 0.508529 -0.698864 -0.575077 -0.414076 0.442153 -0.221269 -0.408799 -0.814611 0.195756 0.227739 0.205842 0.233757 0.220988 0.202315 0.238404 0.230626 0.260859 0.267863 0.220229 0.229849 0.225754 0.222607 0.233503
chargesum: 0.00000
title: Mulliken charges with hydrogens summed into heavy atoms:
elementType: N C C C C C C C C C C
charge: -0.065606 -0.151596 0.141184 0.508529 -0.041804 -0.336673 -0.183450 0.442153 -0.001040 -0.178950 -0.132747
polarizability: 1.46058321e+02 -3.94967573e+00 1.14258762e+02 1.04896673e+01 6.27412210e+00 7.77651362e+01
1716.lowfreq: -22.5753 -12.0229 -6.5453 -0.0006 0.0005 0.0007 31.9460 36.2104 60.2538
frequency: 29.7615 35.7467 60.2122 93.1044 204.9681 229.4247 232.6167 251.6198 282.1280 328.5086 379.6687 398.0971 440.8872 443.2430 515.8604 534.2821 591.0891 621.1827 706.3315 742.4693 786.8225 836.9759 879.3605 898.5087 910.5283 924.9814 960.4619 978.3009 989.1934 995.8357 999.1031 1047.1150 1063.8910 1099.7354 1129.1960 1169.4681 1182.1943 1211.1837 1221.6314 1257.9343 1282.2198 1310.2541 1336.7986 1366.7239 1378.6040 1385.2377 1395.2209 1430.0169 1463.9905 1471.4874 1472.4226 1474.0157 1478.6072 1484.5386 1597.2819 1617.3546 1633.8005 2858.1233 2968.6432 2973.1738 2976.8313 3045.2045 3054.1582 3067.3445 3082.8731 3094.3764 3108.2386 3111.9544 3121.8484 3148.1647 3444.9178 3574.3735
redmass: 2.9903 1.0161 3.1620 3.7385 3.0352 1.3010 2.0598 1.5883 1.5963 2.9166 2.5368 2.2048 2.7345 2.2125 4.9894 3.1145 1.5089 3.6476 2.3161 3.4509 1.6573 2.2647 1.5520 1.3157 1.5229 2.0769 1.9035 1.3451 5.1742 1.5418 1.5470 1.5677 1.6262 1.6155 1.9569 1.5470 1.1180 1.5024 1.4099 2.1486 1.5790 1.2777 1.4246 1.6089 5.4879 1.3070 1.2275 2.4020 1.1502 1.1412 1.2791 1.0651 1.0630 1.6735 5.8471 6.2401 1.1003 1.0819 1.0627 1.0385 1.0373 1.0980 1.0950 1.0983 1.0997 1.0996 1.0900 1.0869 1.0916 1.0992 1.0447 1.0975
irintensity: 1.0148 0.5211 0.3810 0.7953 2.2547 12.5354 5.9190 13.5707 15.6319 14.1856 0.4717 1.4028 11.3701 11.7061 1.1600 18.3014 179.0566 19.8929 21.4755 7.6687 37.2471 2.9988 0.0724 2.2033 1.9052 3.5534 2.8048 0.0581 0.0171 0.7094 0.4641 15.6162 3.9079 12.3207 18.6510 1.0864 0.5382 7.7064 16.2163 0.6115 3.9622 0.7498 38.9932 2.4519 0.0433 27.7839 10.6187 2.3250 1.5532 14.3133 6.1666 10.7892 13.5589 18.8920 7.0580 22.1964 51.1868 83.4756 50.4069 33.5318 24.6613 18.0335 24.7474 43.3657 18.3868 30.8028 15.7538 7.3690 30.2432 28.6043 1.8592 0.0587
temp: 298.150 k
press: 1.00000 atm
elementType: 7 6 6 6 6 6 6 6 6 6 6 1 1 1 1 1 1 1 1 1 1 1 1 1 1 1
symmnumber: 1
zpe: 591388.4 jmol-1
zpe.correction: 0.225248 hartree
zpe.thermalcorrener: 0.237255 hartree
zpe.thermalcorrenthalpy: 0.238199 hartree
zpe.thermalcorrgfe: 0.186083 hartree
zpe.sumelectzpe: -443.973954 hartree
zpe.sumelectthermal: -443.961947 hartree
zpe.sumelectthermalent: -443.961003 hartree
zpe.sumelectthermalfe: -444.013119 hartree
dipole: -0.3359 0.5460 0.8132
dipole: 1.0355
quadrupole: -59.7538 -63.7167 -70.3787
quadrupole: -5.6688 -1.2998 0.2159
quadrupole: 4.8626 0.8997 -5.7623 -5.6688 -1.2998 0.2159
hfenergy: -444.1992022 hartree
pointgroup: C01 [X(C10H15N1)]
dipole: -0.1167229 -0.1975906 -0.3366204 debye
dipolederiv: -0.7806853 0.0171629 0.1648409 0.0948258 -0.416451 -0.1914288 0.1713359 -0.1882312 -0.4861721 -0.1595742 0.0065955 -0.0212447 0.0202233 0.1280812 0.0020153 -0.2072707 0.0229019 0.0595169 0.7416236 -0.0178622 -0.1452301 0.0313461 0.2964087 0.0451435 0.0612317 0.0529965 0.2979876 0.363221 -0.0303582 -0.0547009 -0.0330728 0.0002013 0.0133722 -0.138593 0.0303293 -0.0418093 -0.0255214 -0.0244682 0.0200578 -0.0442288 -0.0678808 0.0896369 0.0424376 0.0994832 0.021469 -0.2499466 -0.1140355 -0.0507241 -0.0966408 -0.0251618 0.0714735 -0.0150851 0.08113 -0.1436756 -0.1463968 0.0614686 -0.0100021 0.1300528 -0.0285686 0.0293311 0.0518793 0.0381361 -0.1705318 0.1511213 0.1683037 0.0074851 0.2259441 0.2692257 0.030415 -0.0316406 -0.0101272 -0.0147619 0.0365282 -0.0099569 -0.0489494 -0.0241404 0.0942682 0.0779117 -0.0541981 0.0876212 -0.0943841 -0.0063484 -0.0135881 -0.0805232 -0.0862698 -0.2058589 0.0255422 -0.085278 0.00863 -0.1606565 0.0170087 -0.0794649 -0.0060019 -0.1276838 -0.0889188 -0.0096576 0.0467757 0.0491323 0.0749985 -0.0168178 -0.0336682 0.0477447 -0.0710267 -0.1048895 0.1349421 0.051155 0.078375 -0.0014909 0.0345959 0.0027551 0.0058509 0.0342433 -0.0454634 -0.1305202 0.025587 -0.0725355 -0.0067564 -0.083476 0.0487046 0.0775741 0.0945236 -0.1403124 -0.1335653 0.0868139 -0.0944273 -0.1215395 -0.0873652 -0.0478989 0.101393 -0.0413661 0.0715222 -0.0024958 0.1164831 -0.0074478 0.0651495 0.0958479 0.0252351 0.0127453 0.0277282 -0.0527239 -0.0726262 0.0340889 -0.141214 -0.014566 -0.0624194 0.0450187 -0.1600183 0.010438 0.0656379 0.0191502 -0.1625323 0.0454872 -0.0765717 0.0698189 0.060115 0.0482008 0.0574193 -0.054728 -0.0790809 0.0520626 -0.0869079 0.0926391 -0.0031304 -0.1259149 0.0071924 -0.1151972 -0.0261714 -0.030795 0.0054993 -0.0264629 0.1273553 0.1704956 -0.0094045 0.0149032 -0.0755289 0.0244319 0.166672 0.0087417 0.0926964 0.2634061 0.047107 -0.0021957 -0.067429 -0.0847432 0.2789114 0.0591043 -0.1758085 0.091777 0.0936979 0.0483498 0.060502 0.0448105 0.0667256 -0.0803928 -0.095494 0.0523838 -0.097898 0.1055773 -0.1273059 0.0060609 0.0774445 -0.0104723 0.0951997 -0.0209754 0.0715637 -0.0262487 0.1252161 0.0609785 0.0311379 0.0793329 -0.0176914 0.0079999 -0.0940019 0.0037298 -0.1387487 -0.0542028 -0.1556007 0.0005114 -0.0303126 0.0954881 0.0535101 0.0024518 -0.0120754 -0.02026 0.1033927 0.0678917 -0.0247552 -0.0344401 -0.0608959 -0.0478767 0.0934793 0.0007128 0.1318131 -0.0432879 unknown
polarizability: 145.7644944|6.3133525|113.7426912|-9.6314559|8.4124715|78.5750339 unknown
InChI: InChI=1S/C10H15N/c1-8-4-3-5-10(6-8)7-9(2)11/h3-6,9H,7,11H2,1-2H3
charge 0 multiplicity 1
26 atoms
N  -3.939961 -0.147094 0.207405
C  -1.568302 -0.251519 0.856437
C  -2.56331 -0.080732 -0.331463
C  -0.114584 -0.352519 0.422914
C  -2.375619 1.265277 -1.05663
C  0.768372 0.747685 0.561314
C  0.385345 -1.550623 -0.152059
C  2.121578 0.683728 0.139867
C  1.72979 -1.635702 -0.573833
C  2.594003 -0.526445 -0.428556
C  3.035967 1.890126 0.276084
H  -1.856251 -1.17003 1.409103
H  -1.723305 0.599802 1.544928
H  -2.345175 -0.897919 -1.064165
H  -1.349737 1.359529 -1.451747
H  -2.570176 2.098948 -0.357414
H  -3.078726 1.357185 -1.906984
H  0.392965 1.675608 1.013462
H  -0.277111 -2.419418 -0.255187
H  -4.15845 -1.019766 0.70005
H  -4.667183 0.105533 -0.469665
H  2.109135 -2.568258 -1.007822
H  3.639718 -0.601048 -0.751764
H  2.783967 2.491956 1.167401
H  4.09524 1.588323 0.35579
H  2.949508 2.556974 -0.604166
