program: Gaussian 09
title: 000115788
version: EM64L-G09RevD.01
frameworkgroup: C1[X(C11H16O3)]
method: RPBEPBE
basis: SDD
operation: Freq
keyword: #pfreq=noraman
keyword: PBEPBE/SDD
title: #p freq=noraman PBEPBE/SDD
converged: YES YES NO NO
title: Mulliken charges:
elementType: O O O C C C C C C C C C C C H H H H H H H H H H H H H H H H
charge: -0.273016 -0.450382 -0.446118 -0.081919 -0.282585 0.524467 0.376471 -0.529036 -0.566796 -0.388856 -0.427534 -0.377098 -0.217778 -0.673784 0.209114 0.239685 0.190178 0.208857 0.206787 0.254447 0.202044 0.237719 0.231738 0.245931 0.219455 0.222166 0.214751 0.226202 0.357011 0.347879
chargesum: 0.00000
title: Mulliken charges with hydrogens summed into heavy atoms:
elementType: O O O C C C C C C C C C C C
charge: -0.273016 -0.093372 -0.098239 0.127195 0.147277 0.524467 0.376471 -0.113392 -0.312349 0.050908 -0.195796 -0.131167 0.001677 -0.010666
polarizability: 1.82936393e+02 -1.06445972e+00 1.25385450e+02 -1.33738360e+00 9.12681004e+00 8.61758371e+01
1716.lowfreq: -6.9768 -1.3740 -0.0004 0.0003 0.0006 12.7439 23.3864 29.8825 46.1877
frequency: 22.9244 29.6383 46.1059 70.6298 90.3657 133.5886 143.6303 197.0065 225.2748 227.5404 233.6379 300.9565 313.3770 319.8850 354.2197 430.1607 457.3938 495.8735 508.9935 513.3529 536.1823 613.1999 618.0527 700.5340 722.9251 782.4585 789.2445 848.0555 864.0871 875.3054 896.9749 925.3057 941.0271 966.5215 974.5727 983.9507 1008.6588 1038.5695 1056.9449 1063.9150 1066.5251 1092.2116 1105.1137 1154.1418 1157.8856 1184.1861 1218.1108 1240.0366 1250.7655 1255.1003 1299.3330 1304.0762 1312.7762 1329.8703 1343.9915 1370.3244 1387.6526 1387.7355 1412.7630 1443.3031 1450.0333 1461.8444 1470.5563 1472.4326 1480.0371 1491.1836 1588.4781 1621.1117 2943.4242 2944.9464 2979.3545 2985.9471 2987.8015 3030.0701 3038.8964 3077.3616 3085.0312 3088.2172 3121.4290 3141.5449 3145.0926 3166.1050 3492.2310 3561.0918
redmass: 4.1095 3.0849 4.6501 3.7367 3.8144 3.0923 3.4873 1.8728 2.7173 2.3271 4.6891 3.1066 2.8903 1.1678 2.6804 2.7521 3.1066 2.0536 2.2958 4.0086 1.7800 4.6191 4.0541 2.0104 4.8605 1.4308 1.2488 2.9850 3.8817 1.4041 1.4906 1.6135 4.7321 1.3254 2.9122 4.7849 3.0361 1.8721 1.8004 1.8276 2.0295 2.7570 1.5199 1.4474 1.6801 1.1381 1.1065 1.3752 1.4388 1.6291 1.2405 1.2740 1.5573 1.3032 1.2578 1.2571 1.8402 2.0288 1.8018 1.8724 1.1453 1.3207 1.0791 1.3600 1.5016 1.1051 6.1347 6.6573 1.0692 1.0743 1.0349 1.0647 1.0598 1.1010 1.1017 1.1000 1.1012 1.1001 1.0863 1.0927 1.0925 1.0962 1.0647 1.0663
irintensity: 1.7462 1.8928 2.0170 1.2798 7.6537 3.6629 0.5122 2.3932 0.6376 1.3353 3.7488 11.7935 5.6012 71.4587 18.4013 18.4240 9.8534 13.5494 68.9871 2.0961 134.8587 22.6245 1.1020 28.7073 8.9155 32.5979 13.1127 23.3380 1.3016 1.3521 21.2605 33.0973 161.1251 1.0463 15.1901 0.1527 31.4685 11.4049 19.7630 12.8593 49.3210 22.2445 6.2113 84.6302 38.3680 0.8586 3.1635 8.6762 61.1156 97.4594 35.3538 10.9675 9.6110 11.5896 6.5850 6.8337 13.5143 4.1290 19.0821 64.2192 5.6620 7.4242 7.4865 21.4045 27.1540 12.7574 64.8382 95.8342 28.7205 53.0986 40.6739 51.8744 37.5944 27.2004 9.4009 58.8036 40.9612 25.1149 5.4662 31.5338 6.0034 14.5503 19.8264 10.5107
temp: 298.150 k
press: 1.00000 atm
elementType: 8 8 8 6 6 6 6 6 6 6 6 6 6 6 1 1 1 1 1 1 1 1 1 1 1 1 1 1 1 1
symmnumber: 1
zpe: 654723.2 jmol-1
zpe.correction: 0.249371 hartree
zpe.thermalcorrener: 0.264369 hartree
zpe.thermalcorrenthalpy: 0.265313 hartree
zpe.thermalcorrgfe: 0.205318 hartree
zpe.sumelectzpe: -653.327215 hartree
zpe.sumelectthermal: -653.312217 hartree
zpe.sumelectthermalent: -653.311273 hartree
zpe.sumelectthermalfe: -653.371269 hartree
dipole: -0.5852 1.0588 -2.4719
dipole: 2.7520
quadrupole: -76.8173 -78.4659 -86.6908
quadrupole: -0.1628 9.6075 5.2778
quadrupole: 3.8407 2.1921 -6.0328 -0.1628 9.6075 5.2778
hfenergy: -653.5765863 hartree
pointgroup: C01 [X(C11H16O3)]
dipole: -0.2106997 -0.5592722 0.9028406 debye
polarizability: 182.8488495|2.6214168|122.040612|0.6620466|14.3889666|89.6082186 unknown
InChI: InChI=1S/C11H16O3/c1-2-9-4-3-5-11(6-9)14-8-10(13)7-12/h3-6,10,12-13H,2,7-8H2,1H3
charge 0 multiplicity 1
30 atoms
O  -0.840491 0.332854 0.148367
O  -3.514813 1.200598 -1.177345
O  -5.687021 0.320998 0.350162
C  -3.247324 0.360565 -0.00593
C  -1.993399 -0.462857 -0.291654
C  2.850897 0.16805 0.253087
C  0.441086 -0.211511 -0.051351
C  4.00304 1.068665 0.678269
C  1.513967 0.601669 0.388091
C  -4.478877 -0.526465 0.272119
C  3.102501 -1.104733 -0.329641
C  0.691501 -1.477741 -0.634907
C  2.031848 -1.91115 -0.766488
C  4.511503 1.960273 -0.486821
H  -3.048595 0.996721 0.886162
H  -1.938289 -0.666506 -1.378716
H  -2.011645 -1.424882 0.265616
H  3.684649 1.718523 1.515604
H  4.842518 0.45151 1.052221
H  1.279724 1.575177 0.83307
H  -4.343302 -1.125012 1.196027
H  -4.674894 -1.200525 -0.578614
H  4.135018 -1.458048 -0.43555
H  -0.123359 -2.118755 -0.983483
H  2.233521 -2.891429 -1.213541
H  4.866972 1.341508 -1.330632
H  5.346473 2.604987 -0.155493
H  3.701796 2.609766 -0.865384
H  -4.458804 1.506935 -1.096149
H  -5.7000 0.794112 1.221001
