program: Gaussian 09
title: 000115626
version: EM64L-G09RevD.01
frameworkgroup: C1[X(C5H10OS)]
method: RPBEPBE
basis: SDD
operation: Freq
keyword: #p
keyword: freq=noraman
keyword: PBEPBE/SDD
title: #p freq=noraman PBEPBE/SDD
converged: YES YES NO NO
title: Mulliken charges:
elementType: S O C C C C C H H H H H H H H H H
charge: -0.031800 -0.293472 0.406024 -0.532469 -0.305390 -0.773057 -0.718305 0.235567 0.245929 0.209123 0.213449 0.278631 0.289283 0.223832 0.237068 0.215403 0.100183
chargesum: 0.00000
title: Mulliken charges with hydrogens summed into heavy atoms:
elementType: S O C C C C C
charge: 0.068383 -0.293472 0.406024 -0.050973 0.117182 -0.205143 -0.042001
polarizability: 8.60152006e+01 5.02058217e+00 6.75775077e+01 4.55153786e+00 -2.39754296e-01 5.81950113e+01
1716.lowfreq: -13.1309 -0.0033 -0.0017 -0.0010 0.5216 11.3513 70.3424 84.8114 175.2337
frequency: 70.2414 84.7202 175.2292 192.8463 231.2190 302.8917 328.7965 371.8051 426.2787 644.5418 677.1225 752.4235 789.7363 793.0903 841.4371 904.0769 936.0018 963.6295 976.0078 992.3858 1075.4502 1088.9945 1115.9939 1180.2141 1241.9295 1248.9533 1267.5457 1296.3047 1316.3814 1380.7974 1437.8897 1462.0035 1467.1752 1476.5920 1494.0917 2444.7519 2982.0880 3002.2056 3035.8097 3039.8744 3063.5258 3077.9827 3093.2007 3110.6180 3114.6869
redmass: 2.9777 2.0835 4.1967 1.0892 1.1722 3.0427 2.5047 2.7821 2.5766 3.9995 3.7803 1.3943 1.8793 1.5295 2.6761 7.9262 1.4083 1.9217 1.6046 2.4072 1.9371 1.1580 1.2732 1.3223 1.4186 1.2592 2.3084 1.7775 1.6744 1.2743 1.0849 1.0604 1.0636 1.0773 1.1044 1.0385 1.0360 1.0563 1.0582 1.0613 1.1112 1.0990 1.0996 1.1072 1.1072
irintensity: 1.8486 2.3312 9.3870 9.9725 15.4540 3.9106 2.5545 2.9279 4.9099 5.8269 21.3453 4.8350 14.8721 11.5791 1.0691 60.8623 5.3335 8.8247 2.7281 0.8968 15.7208 0.0726 7.8754 2.4832 5.0564 12.0002 22.0366 8.8339 16.0068 32.0093 12.2203 5.4329 26.6427 0.7745 1.1899 25.2851 18.1729 92.7621 16.9522 16.7410 26.5736 22.0292 17.6229 18.1941 26.3887
temp: 298.150 k
press: 1.00000 atm
elementType: 16 8 6 6 6 6 6 1 1 1 1 1 1 1 1 1 1
symmnumber: 1
zpe: 364678.8 jmol-1
zpe.correction: 0.138899 hartree
zpe.thermalcorrener: 0.147396 hartree
zpe.thermalcorrenthalpy: 0.148340 hartree
zpe.thermalcorrgfe: 0.105505 hartree
zpe.sumelectzpe: -669.194709 hartree
zpe.sumelectthermal: -669.186212 hartree
zpe.sumelectthermalent: -669.185267 hartree
zpe.sumelectthermalfe: -669.228103 hartree
dipole: -0.4367 0.4405 1.3495
dipole: 1.4853
quadrupole: -54.4040 -48.1911 -52.9889
quadrupole: 6.0344 -4.6664 1.0389
quadrupole: -2.5427 3.6702 -1.1275 6.0344 -4.6664 1.0389
hfenergy: -669.3336075 hartree
pointgroup: C01 [X(C5H10O1S1)]
dipole: 0.1740113 0.0708045 -0.5533219 debye
dipolederiv: -0.3915074 -0.0282304 0.0574474 -0.0016449 0.1366161 0.0302359 0.0092903 -0.0185066 -0.2411777 -0.9201886 0.1816679 -0.0555515 0.1710023 -0.5007446 -0.010286 -0.0060039 0.0135454 -0.4086821 0.6426606 -0.1433636 -0.0039302 0.0103774 0.3744048 -0.1107017 -0.0639075 -0.2290824 0.2136707 -0.1135182 0.1115902 -0.0288804 0.1255011 -0.0514519 -0.0506866 0.006663 -0.0596735 0.0113015 0.4481821 -0.1155762 -0.055992 -0.3414304 0.4274651 -0.0581734 -0.2456613 0.0370876 0.2062885 0.3663781 0.0618895 0.1105542 -0.0442457 -0.0339403 -0.0182383 0.2440706 0.0875126 0.0941191 -0.0375471 0.0139309 0.0180047 0.0299001 -0.1512454 0.1218044 0.0074305 0.1108891 -0.0220904 0.057985 -0.0135578 0.0351864 -0.0191564 0.0832461 0.0791456 0.0359597 0.0351067 -0.1246411 0.0471034 -0.1078127 -0.0318782 -0.0934782 -0.0696568 -0.0256691 -0.01489 0.0199294 0.0808095 0.0384106 0.0368802 -0.0074504 0.1237917 -0.1535927 0.0970744 -0.0409155 0.1031905 -0.0110729 -0.188349 -0.0013513 0.0764876 -0.0376433 0.0414659 0.0177733 0.1479912 -0.0019811 0.0256711 -0.0359708 -0.007283 -0.0178478 0.0070432 -0.0012401 -0.129371 0.0078091 -0.0816667 -0.0222417 0.0252093 0.0240633 -0.0470388 -0.0077936 -0.042481 0.085347 -0.0265934 0.0633714 0.0671058 0.0843745 0.0659219 0.0456604 0.0641023 -0.0312847 -0.0707218 0.0408598 -0.1246368 -0.0258532 -0.0670102 -0.0788917 0.1044547 -0.0318505 0.0704793 0.0340642 0.0912514 0.0412957 0.0466869 -0.0334541 0.0260595 -0.13334 -0.0046261 0.0707006 -0.0318732 -0.1179976 0.0001967 0.0047285 0.0772415 -0.0259366 -0.0658861 0.0501511 -0.1687403 0.0402762 -0.0753564 0.003422 0.1053776 unknown
polarizability: 86.1967637|-3.2789473|67.0214361|5.754912|-1.4264346|58.5695197 unknown
InChI: InChI=1S/C5H10OS/c1-5(4-7)2-3-6-5/h7H,2-4H2,1H3
charge 0 multiplicity 1
17 atoms
S  -2.704062 -0.538226 -0.125242
O  1.300491 0.3639 0.850389
C  0.052177 0.319397 -0.048562
C  0.705064 -0.795882 -0.928669
C  1.92026 -0.752559 0.038385
C  -1.112813 -0.143389 0.835692
C  -0.166537 1.676891 -0.712548
H  0.924416 -0.477813 -1.960119
H  0.142995 -1.742798 -0.954748
H  2.074842 -1.654915 0.657562
H  2.88058 -0.42935 -0.40079
H  -1.340337 0.612313 1.605619
H  -0.857255 -1.089624 1.339655
H  -0.438207 2.440144 0.039841
H  0.759934 2.005769 -1.213201
H  -0.970207 1.621678 -1.470073
H  -3.065841 0.773364 -0.383791
