program: Gaussian 09
title: 000115606
version: EM64L-G09RevD.01
frameworkgroup: C1[X(C17H24N2O)]
method: RPBEPBE
basis: SDD
operation: Freq
keyword: #p
keyword: freq=noraman
keyword: PBEPBE/SDD
title: #p freq=noraman PBEPBE/SDD
converged: YES YES NO NO
title: Mulliken charges:
elementType: O N N C C C C C C C C C C C C C C C C C H H H H H H H H H H H H H H H H H H H H H H H H
charge: -0.291348 -0.144447 -0.079748 -0.154441 -0.143874 -0.439601 -0.441603 -0.377622 -0.391122 -0.340624 0.206759 -0.582335 -0.472960 0.498852 -0.674402 -0.410408 -0.417687 -0.229824 -0.227694 -0.242990 0.282240 0.240596 0.213250 0.228780 0.225852 0.215661 0.217953 0.213278 0.191780 0.222922 0.197277 0.221716 0.219731 0.217600 0.221857 0.220404 0.201764 0.228614 0.234012 0.232929 0.232924 0.224393 0.223807 0.227779
chargesum: 0.00000
title: Mulliken charges with hydrogens summed into heavy atoms:
elementType: O N N C C C C C C C C C C C C C C C C C
charge: -0.291348 -0.144447 -0.079748 0.127799 0.096722 0.002429 -0.000090 0.053609 0.023580 0.078368 0.206759 -0.145004 -0.030699 0.498852 -0.010013 -0.177479 -0.184763 -0.005430 -0.003887 -0.015210
polarizability: 2.46395485e+02 7.91714987e-01 1.78400733e+02 -1.30605668e+01 -1.47749018e+01 1.56818513e+02
1716.lowfreq: -7.6162 -0.0009 -0.0007 -0.0004 3.3587 9.0796 15.2769 21.9014 32.9212
frequency: 15.1638 21.8209 32.8218 51.1479 52.0496 61.6785 89.0915 107.7931 148.1563 157.6205 179.2298 192.0350 225.5942 270.0701 289.5588 320.1143 336.9743 347.1943 358.1469 388.1443 403.4076 474.0401 485.4605 507.5910 508.5584 543.4030 575.4850 618.2325 625.1900 689.1461 705.8301 748.6963 756.5490 763.3050 791.4556 795.2228 803.8278 826.9228 841.0492 853.4212 856.7807 904.5594 915.4807 923.0031 932.6174 975.5959 979.5112 989.9358 993.9127 995.2583 1014.3191 1018.0667 1022.9732 1027.1687 1042.3010 1047.3227 1074.8537 1079.7450 1089.0522 1093.0379 1120.3205 1136.5245 1154.7666 1165.5404 1172.0659 1186.8403 1195.5739 1199.0550 1209.0810 1219.4275 1239.1671 1252.6412 1258.8748 1264.2388 1278.0125 1285.1577 1290.5554 1295.9084 1309.3997 1316.6942 1326.5114 1328.9907 1334.7346 1359.2777 1382.6633 1387.2303 1394.4841 1412.8257 1440.6264 1447.6709 1452.0233 1459.6986 1464.6025 1465.7362 1471.3577 1473.6938 1479.3631 1483.9284 1487.1437 1582.9558 1592.8578 1614.8272 2842.0237 2854.5572 2875.1599 2966.3175 2994.3875 2997.1329 3012.8800 3013.6268 3015.8849 3016.7907 3028.0694 3039.2912 3059.2458 3071.2504 3077.5042 3089.3015 3092.6972 3099.4745 3106.1478 3114.1658 3115.0643 3131.2584 3143.1385 3161.8026
redmass: 3.7018 4.8344 3.7602 3.0678 4.1058 2.8348 2.2554 3.3883 3.1568 1.9256 1.4963 2.1870 4.1956 3.2367 3.0008 2.4251 2.4696 2.5189 3.7764 3.3588 2.8196 3.4693 3.6950 3.0257 3.8875 3.4465 3.9928 6.3637 3.4749 3.2667 1.7302 3.5269 3.1940 2.7171 1.2517 1.6253 1.3460 3.1961 2.8720 1.2763 2.4019 2.8382 1.6407 2.5044 1.7599 1.3926 2.1885 6.2682 1.3590 1.9807 1.6482 1.8872 2.3291 2.1424 1.8381 2.7372 1.5761 1.9060 2.4192 1.6413 2.0082 2.2461 1.8120 1.3661 1.0559 1.1157 1.2847 1.5386 1.7364 2.2368 1.3450 1.1887 1.4519 1.4037 1.3628 1.4234 1.4970 1.3962 1.5404 1.5151 1.2759 1.6128 1.3626 1.3866 7.6005 1.3987 1.2300 3.9188 2.1782 1.1099 1.0833 1.0863 1.0408 1.0874 1.0992 1.1262 1.0562 2.1318 1.1234 8.2728 6.0471 6.1903 1.0703 1.0706 1.0699 1.0596 1.0604 1.0368 1.0727 1.0761 1.0988 1.0871 1.0627 1.0888 1.1029 1.0905 1.0997 1.0893 1.0997 1.1044 1.1001 1.0871 1.0869 1.0908 1.0958 1.1015
irintensity: 0.0866 0.5681 0.2214 0.9208 0.3610 0.1164 2.4352 1.8426 1.6249 0.3743 0.3268 5.0707 1.2555 7.6004 2.3681 3.6233 2.8329 2.8844 5.5240 0.8279 0.0024 1.8003 0.9161 16.8425 10.3793 2.1216 0.9901 0.0740 5.8040 0.3615 51.9933 8.0452 12.4513 24.1593 1.8934 6.7983 16.4424 7.2564 20.1130 0.5483 5.4417 1.5416 5.4787 1.6842 0.7124 0.1521 5.4689 0.1891 2.0919 16.3586 5.8391 1.9707 38.2612 5.6901 5.4683 23.0438 1.0153 16.5668 3.3580 3.4883 23.3778 60.0948 9.2572 13.4479 0.1596 0.3267 10.5497 20.1003 11.0783 2.7147 21.7956 0.4337 2.3322 3.3246 4.7974 25.7257 30.3329 10.0722 4.6704 8.2278 0.6779 10.6136 8.1025 6.4489 0.1008 6.7554 12.9277 230.0950 6.9635 29.6243 2.7878 7.7524 8.2335 18.5073 7.2342 0.2957 17.3051 24.4636 7.4094 314.1520 1.9556 10.8336 53.7200 98.7793 92.4620 31.4750 21.5046 37.5423 10.8303 7.1824 20.5120 55.5622 53.2889 38.5302 24.8055 32.2625 2.8390 10.9453 31.8564 56.1998 31.9618 9.9296 7.5429 11.2717 44.4157 24.9411
temp: 298.150 k
press: 1.00000 atm
elementType: 8 7 7 6 6 6 6 6 6 6 6 6 6 6 6 6 6 6 6 6 1 1 1 1 1 1 1 1 1 1 1 1 1 1 1 1 1 1 1 1 1 1 1 1
symmnumber: 1
zpe: 994377.4 jmol-1
zpe.correction: 0.378738 hartree
zpe.thermalcorrener: 0.397907 hartree
zpe.thermalcorrenthalpy: 0.398851 hartree
zpe.thermalcorrgfe: 0.327964 hartree
zpe.sumelectzpe: -845.417284 hartree
zpe.sumelectthermal: -845.398115 hartree
zpe.sumelectthermalent: -845.397171 hartree
zpe.sumelectthermalfe: -845.468058 hartree
dipole: 1.9048 1.7373 -2.9969
dipole: 3.9532
quadrupole: -128.8524 -119.2236 -120.7302
quadrupole: -9.8198 10.4810 1.1420
quadrupole: -5.9170 3.7118 2.2052 -9.8198 10.4810 1.1420
hfenergy: -845.7960226 hartree
pointgroup: C01 [X(C17H24N2O1)]
dipole: -0.7239508 -0.7489969 -1.1549362 debye
polarizability: 246.2594638|3.7796047|179.5174627|12.2960243|14.5256485|155.8378043 unknown
InChI: InChI=1S/C17H24N2O/c1-2-17(20)19-15-8-9-16(19)13-18(12-15)11-10-14-6-4-3-5-7-14/h3-7,15-16H,2,8-13H2,1H3
charge 0 multiplicity 1
44 atoms
O  4.189298 1.442599 1.348098
N  3.043541 -0.167747 0.140467
N  0.197509 -0.539448 -0.126524
C  2.250243 -0.693626 1.279076
C  2.492106 -0.872336 -1.043023
C  2.270467 -2.2271 1.010515
C  2.426057 -2.34881 -0.545001
C  0.819817 -0.109142 1.156169
C  1.073787 -0.29464 -1.301946
C  -1.172545 -0.020117 -0.333459
C  3.93763 0.883107 0.232337
C  -2.209577 -0.612512 0.659028
C  4.614746 1.317072 -1.080692
C  -3.622873 -0.175796 0.303078
C  5.673586 2.410441 -0.852482
C  -4.133718 1.0693 0.753777
C  -4.444068 -0.980561 -0.528597
C  -5.427735 1.49992 0.383561
C  -5.73944 -0.555379 -0.901072
C  -6.235586 0.688686 -0.4469
H  2.712332 -0.383941 2.228891
H  3.124872 -0.739207 -1.934612
H  1.340808 -2.703362 1.363261
H  3.125011 -2.691207 1.532627
H  3.355834 -2.881469 -0.811232
H  1.572937 -2.879543 -0.999193
H  0.20092 -0.476866 1.994058
H  0.884153 1.004579 1.239653
H  1.17803 0.796525 -1.536298
H  0.618156 -0.785883 -2.182989
H  -1.209071 1.098098 -0.271421
H  -1.483676 -0.291292 -1.360839
H  -1.966826 -0.289081 1.688633
H  -2.116758 -1.713935 0.62721
H  5.075829 0.432516 -1.56476
H  3.835386 1.680788 -1.781557
H  6.116828 2.727057 -1.81416
H  6.479327 2.045131 -0.193671
H  5.226616 3.288915 -0.358046
H  -3.515956 1.700611 1.405189
H  -4.066547 -1.949382 -0.879688
H  -5.807161 2.462977 0.744058
H  -6.361628 -1.193482 -1.539165
H  -7.240563 1.019544 -0.732158
