program: Gaussian 09
title: 000115604
version: EM64L-G09RevD.01
frameworkgroup: C1[X(C11H20N2O2)]
method: RPBEPBE
basis: SDD
operation: Freq
keyword: #p
keyword: freq=noraman
keyword: PBEPBE/SDD
title: #p freq=noraman PBEPBE/SDD
converged: YES YES NO NO
title: Mulliken charges:
elementType: O O N N C C C C C C C C C C C H H H H H H H H H H H H H H H H H H H H
charge: -0.308503 -0.272111 -0.069404 -0.069103 -0.150601 -0.149520 -0.425031 -0.425236 -0.397802 -0.398529 -0.323044 -0.608748 0.283106 -0.476462 -0.658503 0.236103 0.235645 0.212050 0.222950 0.222859 0.211918 0.214933 0.219565 0.220568 0.214651 0.235973 0.238978 0.218964 0.218984 0.192487 0.232990 0.233978 0.232175 0.208787 0.224933
chargesum: 0.00000
title: Mulliken charges with hydrogens summed into heavy atoms:
elementType: O O N N C C C C C C C C C C C
charge: -0.308503 -0.272111 -0.069404 -0.069103 0.085502 0.086125 0.009969 0.009541 0.036696 0.036690 0.151907 0.021687 0.283106 -0.009495 0.007393
polarizability: 1.66946799e+02 2.13355774e+00 1.32019127e+02 2.55277770e-01 -3.64529010e-01 1.13887258e+02
1716.lowfreq: -6.9180 -0.0006 -0.0005 -0.0004 3.6666 9.4699 14.4664 24.1455 47.1755
frequency: -5.1488 23.5737 47.0049 49.7492 112.2391 150.2026 156.8412 167.8785 198.9248 213.6216 231.5019 266.6021 295.6651 311.5726 339.5748 361.7179 397.2090 419.4950 450.2865 491.5501 542.9833 583.4465 615.0101 649.2082 710.6967 745.2746 761.5041 793.2928 794.7049 826.7440 851.0407 866.6213 907.7613 932.7574 954.3856 978.6730 979.3813 1009.2581 1029.8978 1049.0559 1068.9057 1072.1136 1079.3524 1082.6414 1115.2014 1115.5932 1133.1218 1151.8224 1165.8971 1168.1474 1198.5465 1204.1662 1232.7711 1242.1957 1261.9880 1268.3495 1286.1854 1290.7371 1302.7024 1303.2045 1311.5813 1319.1951 1336.5248 1344.9969 1365.0529 1397.7481 1400.2508 1430.7963 1443.3533 1447.3395 1450.6374 1461.0584 1463.0837 1468.7292 1470.1533 1480.3363 1481.4605 1483.7229 1614.5348 2861.2186 2889.8839 2900.4036 2992.9929 2997.7021 3006.0983 3009.3586 3010.8130 3012.6702 3024.5738 3037.8087 3039.4813 3043.1343 3048.4206 3068.5770 3078.7872 3092.8653 3101.6422 3102.3898 3120.2065
redmass: 4.7383 2.4124 3.7603 2.7931 3.8220 2.6435 3.6705 1.8101 1.3568 4.4959 1.0954 4.3103 1.9955 3.1084 2.1202 2.7453 1.9843 3.1435 4.8821 3.7485 2.6011 4.9821 5.9208 3.5164 4.2794 4.6736 4.1945 1.5162 1.3495 2.3667 3.7680 2.9320 2.7650 1.7833 1.9681 2.3413 1.7851 1.8437 2.3357 1.6662 1.5285 2.4563 1.8906 1.6505 1.8039 1.2978 2.7113 2.6093 1.1419 1.1999 1.4434 1.5415 1.7232 1.1801 1.4291 1.4796 1.3453 1.7320 1.6734 1.4021 1.5209 1.3510 1.8027 1.4108 1.3909 1.2147 2.2268 1.1642 1.0894 1.4246 1.0842 1.0593 1.0780 1.1065 1.0402 1.0822 1.0662 1.0547 8.5758 1.0557 1.0677 1.0668 1.0559 1.0414 1.0906 1.0931 1.0739 1.0619 1.0666 1.0573 1.0847 1.0984 1.0855 1.1008 1.1030 1.1002 1.1048 1.1001 1.1131
irintensity: 1.2652 0.0968 0.3447 1.4981 1.5212 3.0466 1.3615 0.2950 2.3403 20.7100 0.7967 6.9666 1.2765 26.4403 0.4459 1.3674 0.2714 0.7954 40.9014 0.8051 6.3430 109.2457 162.6313 87.6018 35.1162 0.0368 6.5029 5.9711 14.3191 0.0718 23.4784 3.3399 1.7097 0.2362 3.6693 21.1441 13.7796 48.7431 56.4949 0.1658 3.8142 144.4802 0.3089 0.4712 9.7628 35.2050 410.6451 37.9547 3.8908 11.5320 5.6397 5.3283 4.2075 1.0179 14.0369 8.1655 0.8874 44.7122 12.9690 24.5684 17.1721 7.3650 33.9550 0.1429 1.3173 25.8897 101.8165 1.2969 25.0662 28.4606 2.5753 31.2242 0.8779 11.0646 11.9031 0.0931 19.7879 9.1134 220.6472 104.5665 58.5006 101.5292 35.6315 19.4789 32.8703 31.5535 68.0945 17.2780 50.8075 18.8585 90.3500 8.5237 28.8421 33.0139 0.5949 32.0318 51.1002 34.0871 13.4351
temp: 298.150 k
press: 1.00000 atm
elementType: 8 8 7 7 6 6 6 6 6 6 6 6 6 6 6 1 1 1 1 1 1 1 1 1 1 1 1 1 1 1 1 1 1 1 1
symmnumber: 1
zpe: 793244.6 jmol-1
zpe.correction: 0.302131 hartree
zpe.thermalcorrener: 0.316984 hartree
zpe.thermalcorrenthalpy: 0.317929 hartree
zpe.thermalcorrgfe: 0.259424 hartree
zpe.sumelectzpe: -689.900571 hartree
zpe.sumelectthermal: -689.885718 hartree
zpe.sumelectthermalent: -689.884773 hartree
zpe.sumelectthermalfe: -689.943278 hartree
dipole: -2.1620 1.9424 -0.0871
dipole: 2.9077
quadrupole: -99.3929 -92.0631 -85.9423
quadrupole: 9.2498 -0.2232 0.1196
quadrupole: -6.9268 0.4030 6.5238 9.2498 -0.2232 0.1196
hfenergy: -690.2027021 hartree
pointgroup: C01 [X(C11H20N2O2)]
dipole: 1.0232744 -0.470241 0.2011721 debye
polarizability: 163.322872|8.9069873|130.6149553|-6.2777118|-9.1409536|118.9153574 unknown
InChI: InChI=1S/C11H20N2O2/c1-3-11(14)15-8-13-9-4-5-10(13)7-12(2)6-9/h9-10H,3-8H2,1-2H3
charge 0 multiplicity 1
35 atoms
O  -1.379937 -0.144745 -0.087309
O  -3.567511 0.602998 -0.369815
N  0.511996 1.295708 -0.852037
N  2.302584 -0.723768 0.25033
C  1.374685 1.583228 0.325708
C  1.391091 0.475917 -1.729547
C  2.679559 2.078273 -0.36571
C  2.690003 1.334782 -1.746571
C  1.618929 0.270007 1.119752
C  1.637076 -0.907554 -1.0667
C  -0.875995 1.207703 -0.814908
C  2.558603 -1.999129 0.939665
C  -2.754578 -0.265803 0.041264
C  -3.132493 -1.577224 0.728504
C  -4.63907 -1.686054 1.023354
H  0.904005 2.339331 0.978942
H  0.933303 0.343338 -2.725933
H  3.567047 1.825192 0.237086
H  2.642813 3.172698 -0.504738
H  2.657699 2.053204 -2.584012
H  3.583504 0.698768 -1.857412
H  2.271751 0.473068 1.991262
H  0.637187 -0.104555 1.497606
H  0.658307 -1.437652 -0.975988
H  2.30364 -1.517417 -1.707586
H  -1.327634 1.1432 -1.817471
H  -1.341598 2.009475 -0.220355
H  3.141005 -1.814601 1.861063
H  3.15309 -2.663905 0.286328
H  1.622798 -2.542879 1.225671
H  -2.531678 -1.664158 1.653509
H  -2.797229 -2.405631 0.073889
H  -5.228637 -1.58232 0.096741
H  -4.873505 -2.662211 1.484549
H  -4.966912 -0.886784 1.710171
