program: Gaussian 09
title: 000115380
version: EM64L-G09RevD.01
frameworkgroup: C1[X(C11H18N2O3)]
method: RPBEPBE
basis: SDD
operation: Freq
keyword: #p
keyword: freq=noraman
keyword: PBEPBE/SDD
title: #p freq=noraman PBEPBE/SDD
converged: YES YES NO NO
title: Mulliken charges:
elementType: O O O N N C C C C C C C C C C C H H H H H H H H H H H H H H H H H H
charge: -0.472460 -0.405410 -0.228500 -0.165653 -0.351445 0.233389 -0.381070 -0.371859 -0.397220 -0.395115 -0.398725 -0.594173 0.279922 0.048391 -0.066698 -0.729130 0.195291 0.257820 0.251927 0.190678 0.213481 0.223408 0.220381 0.210934 0.241387 0.264414 0.228741 0.194268 0.274555 0.231289 0.242361 0.216674 0.356448 0.381698
chargesum: 0.00000
title: Mulliken charges with hydrogens summed into heavy atoms:
elementType: O O O N N C C C C C C C C C C C
charge: -0.116011 -0.023711 -0.228500 -0.165653 -0.076890 0.233389 0.072041 0.070746 0.039669 0.036200 0.024284 -0.088372 0.279922 0.048391 -0.066698 -0.038807
polarizability: 1.95240609e+02 -1.40849479e+01 1.38765525e+02 -4.66319524e-01 -4.04990023e+00 1.10238566e+02
1716.lowfreq: -13.5334 -8.5324 -0.0004 0.0005 0.0005 4.1564 23.0701 49.1065 60.5524
frequency: 21.3366 48.8279 60.5036 71.2108 119.2778 170.2224 190.2234 215.2256 235.8059 250.3642 278.9913 295.4031 311.1625 314.9361 346.2772 362.3525 398.6934 408.3464 434.5415 441.4708 453.7537 489.2875 537.4949 544.0998 574.1124 603.4520 650.8719 679.3370 731.5853 777.6898 800.4723 847.5635 855.3541 859.2889 864.8478 894.7051 910.2761 940.9069 953.6902 961.3620 990.0841 1043.7725 1059.6921 1068.7828 1074.3770 1095.1127 1110.2761 1111.2183 1143.7806 1152.4610 1157.4040 1198.6684 1224.1322 1228.2923 1260.0541 1266.1505 1277.8626 1294.7845 1320.8304 1329.7545 1339.3151 1343.6981 1349.1222 1351.3005 1358.6686 1377.9922 1445.2226 1451.1916 1459.6098 1461.5421 1465.7071 1468.5227 1470.8643 1472.1801 1478.5279 1498.9445 1600.6291 1660.6291 2893.6874 2900.2448 2975.8215 2979.3863 2984.3450 2992.7865 2994.9973 3037.8573 3040.1035 3048.0447 3054.0844 3059.3950 3063.5799 3071.8907 3079.2253 3089.4619 3402.5506 3495.0774
redmass: 4.4029 4.2687 3.9346 3.4411 6.9484 3.0208 3.9153 3.4674 1.8587 1.2354 3.7938 5.1133 3.0374 2.2465 2.4415 2.8796 2.7982 2.1678 1.3499 2.1795 3.1376 2.2971 3.6658 3.3678 2.9885 3.0948 3.9879 5.8830 8.2814 3.2097 1.4529 2.8139 1.2840 2.0870 1.6259 2.1538 2.2274 1.8074 2.4571 1.3081 2.6354 2.1987 2.2409 1.8572 1.9862 3.8407 1.8066 2.5017 2.0827 1.2585 2.4648 1.6144 1.9385 2.0108 1.2731 1.2078 1.3186 2.3703 1.8908 1.2793 1.9245 1.3959 1.4815 1.4588 1.4587 1.2139 1.6147 1.1469 1.0731 1.0857 1.1355 1.0781 1.0991 1.0665 1.1877 1.5457 7.4211 9.2229 1.0709 1.0693 1.0650 1.0357 1.0580 1.0616 1.0617 1.0665 1.1022 1.0946 1.1006 1.0937 1.1005 1.0933 1.0991 1.1009 1.0764 1.0651
irintensity: 1.5453 0.9706 1.0089 1.0435 0.8912 0.6087 7.8814 2.5656 1.5845 1.1743 17.9669 5.7835 2.0772 4.0098 1.9577 17.7820 16.2435 49.0109 69.6932 45.5611 12.5365 119.7167 24.2108 1.9273 6.2958 0.7321 11.0611 3.0544 1.2372 40.9600 5.5925 4.9523 67.1217 60.9145 14.9304 7.4399 3.6020 21.9929 72.9028 3.1449 4.3010 30.9662 9.2209 29.7361 8.4425 44.3721 31.1779 6.4117 60.0453 4.5673 4.5756 19.2267 5.7277 7.5285 0.3634 10.0822 4.9670 30.1044 119.7533 1.3607 69.8614 0.4063 10.8866 5.1805 10.0219 26.9414 54.9018 51.9940 5.6975 9.6348 2.9554 2.7168 21.9255 1.7382 24.4699 45.9562 543.9789 59.0227 41.1811 120.5142 40.3198 16.4626 37.1408 23.7980 20.3911 436.7611 8.8702 23.8458 36.4511 9.4923 33.4035 25.5371 27.4260 15.4207 28.2670 10.8315
temp: 298.150 k
press: 1.00000 atm
elementType: 8 8 8 7 7 6 6 6 6 6 6 6 6 6 6 6 1 1 1 1 1 1 1 1 1 1 1 1 1 1 1 1 1 1
symmnumber: 1
zpe: 744849.0 jmol-1
zpe.correction: 0.283698 hartree
zpe.thermalcorrener: 0.299589 hartree
zpe.thermalcorrenthalpy: 0.300533 hartree
zpe.thermalcorrgfe: 0.240131 hartree
zpe.sumelectzpe: -763.851931 hartree
zpe.sumelectthermal: -763.836040 hartree
zpe.sumelectthermalent: -763.835096 hartree
zpe.sumelectthermalfe: -763.895498 hartree
dipole: 7.2165 -5.7602 0.7052
dipole: 9.2604
quadrupole: -91.5342 -102.3710 -96.6615
quadrupole: 5.5749 3.4789 4.2133
quadrupole: 5.3214 -5.5154 0.1940 5.5749 3.4789 4.2133
hfenergy: -764.1356295 hartree
pointgroup: C01 [X(C11H18N2O3)]
dipole: -2.9288045 -2.1476599 -0.2888625 debye
polarizability: 196.3054163|11.6927189|137.7108752|0.0946183|4.0900329|110.228409 unknown
InChI: InChI=1S/C11H18N2O3/c1-11(16)7-8(9(14)10(11)15)12-13-5-3-2-4-6-13/h12,14,16H,2-7H2,1H3
charge 0 multiplicity 1
34 atoms
O  3.789777 -0.41302 -1.477198
O  -0.002577 1.554518 0.606447
O  3.022957 1.876245 0.201878
N  -1.782179 -0.397746 -0.042958
N  -0.65007 -1.291175 -0.124086
C  3.023688 -0.564987 -0.222648
C  -2.315153 -0.066463 -1.408833
C  -2.832293 -0.957362 0.862935
C  -3.458989 0.960278 -1.2955
C  -3.989423 0.050761 1.015151
C  -4.576146 0.441458 -0.361424
C  1.849829 -1.543887 -0.484848
C  0.624402 -0.734493 -0.11542
C  2.351165 0.80366 0.109484
C  0.918752 0.579356 0.234692
C  3.962917 -1.000565 0.917281
H  -2.684041 -0.995048 -1.907047
H  -1.476988 0.336778 -2.002976
H  -2.353357 -1.169788 1.833136
H  -3.222308 -1.919459 0.450686
H  -3.85487 1.167846 -2.306946
H  -3.051342 1.91228 -0.903364
H  -3.613376 0.954839 1.532182
H  -4.767812 -0.39549 1.661813
H  1.933161 -2.469635 0.115668
H  1.858383 -1.826846 -1.554437
H  -5.361185 1.209847 -0.23831
H  -5.060778 -0.444371 -0.821357
H  -0.803186 -2.198196 -0.58786
H  4.510893 -1.913821 0.624631
H  4.692873 -0.197527 1.125042
H  3.400618 -1.201003 1.84802
H  4.243676 0.471406 -1.419087
H  -0.908515 1.091312 0.532352
