program: Gaussian 09
title: 000115355
version: EM64L-G09RevD.01
frameworkgroup: C1[X(C14H10F3NO5)]
method: RPBEPBE
basis: SDD
operation: Freq
keyword: #p
keyword: freq=noraman
keyword: PBEPBE/SDD
title: #p freq=noraman PBEPBE/SDD
converged: YES YES NO NO
title: Mulliken charges:
elementType: F F F O O O O O N C C C C C C C C C C C C C C H H H H H H H H H H
charge: -0.156993 -0.153524 -0.154934 -0.169857 -0.154363 -0.167147 -0.170225 -0.170385 0.027771 -0.458461 -0.408662 -0.513525 -0.514371 0.182827 0.223075 0.027874 0.304297 0.240433 -0.294491 0.336741 -0.511379 -0.333652 0.260305 0.322923 0.241580 0.233718 0.269245 0.259492 0.260137 0.273610 0.268536 0.321551 0.277852
chargesum: 0.00000
title: Mulliken charges with hydrogens summed into heavy atoms:
elementType: F F F O O O O O N C C C C C C C C C C C C C C
charge: -0.156993 -0.153524 -0.154934 -0.169857 -0.154363 -0.167147 -0.170225 -0.170385 0.027771 -0.135537 0.066637 0.015212 0.019376 0.182827 0.223075 0.027874 0.304297 0.240433 -0.025954 0.336741 -0.189828 -0.055800 0.260305
polarizability: 2.43353843e+02 -6.44274613e-02 1.90477685e+02 5.62865907e+00 6.14726747e+00 1.16272119e+02
1716.lowfreq: -11.9157 -0.0009 -0.0003 0.0005 2.8226 5.7191 7.2923 10.6366 22.4905
frequency: -10.3238 9.6083 22.3111 34.4779 68.3283 88.1038 105.1757 119.7465 124.2584 130.4595 143.9847 146.3279 172.8135 213.8415 238.8436 251.6271 281.6576 320.4646 358.8583 367.2577 374.0162 391.7256 404.6516 430.5288 437.0028 464.4843 500.1161 507.1601 508.7223 554.7687 596.6518 599.3364 627.2575 656.1238 666.3351 687.5839 695.8408 723.7814 739.5833 763.2675 795.3948 805.8554 847.4980 849.3661 880.5046 884.2437 941.1524 943.9943 970.3998 978.2325 998.5556 1024.7843 1030.1480 1044.2397 1048.9724 1069.5614 1070.3610 1142.1200 1165.4980 1171.6183 1198.8393 1205.2721 1208.6347 1227.6929 1255.1216 1261.6755 1293.3322 1296.3199 1308.9660 1310.6989 1338.5979 1367.6900 1376.8420 1414.3251 1432.8879 1441.4898 1476.7660 1491.5606 1571.7295 1578.4490 1621.9541 1626.1456 1658.9756 2987.6986 3001.4517 3006.0878 3071.0548 3078.1514 3087.7233 3096.1209 3158.8672 3176.4728 3183.8512
redmass: 7.1759 16.5060 8.1284 8.7119 9.0095 10.2485 7.1506 9.9087 8.7843 6.4802 6.5006 5.5920 6.6702 5.4102 3.2671 10.1921 9.6965 11.2196 5.9419 7.2307 5.3101 8.4151 4.4461 3.1590 7.4218 3.2780 6.5105 7.3334 5.8440 7.4758 5.3949 5.7059 5.6059 8.2235 5.9591 6.2095 7.1053 7.8834 3.1413 3.7823 3.0580 4.7571 6.7932 1.4730 1.9168 2.7073 2.3762 1.7307 4.0337 1.5070 8.1694 2.1629 4.4926 8.8235 2.0554 3.5735 3.0261 1.2733 1.5357 2.9639 2.3095 7.1950 1.5087 1.3170 1.8433 1.2905 2.0736 1.7843 1.4052 1.3813 1.4204 4.5231 12.3976 4.9636 1.0953 1.1032 1.0829 3.0028 8.6638 8.8982 9.4165 7.0737 10.2954 1.0638 1.0634 1.0603 1.1017 1.0862 1.0979 1.1006 1.0894 1.0976 1.0931
irintensity: 1.1395 0.2455 0.8590 0.3637 7.1759 1.1627 2.0708 5.2403 0.8777 1.7858 3.5305 0.2819 2.3477 0.1579 7.5889 0.3920 0.7473 23.9771 5.9823 2.3963 2.5317 4.3077 7.8217 3.5280 8.3588 5.7211 3.6159 5.6809 3.3463 10.7470 16.5206 14.8055 13.7492 12.6999 6.5400 1.2460 1.1116 14.1146 3.9680 3.4839 22.8849 2.5608 11.4639 52.6871 4.8433 23.6688 15.1593 48.7558 250.1471 21.1538 184.6376 145.6530 79.7744 186.0775 3.1775 14.3579 6.8550 1.1028 33.8156 216.8354 137.2914 156.9375 69.7360 6.4996 42.2733 41.0673 185.1384 28.7662 23.4685 14.5122 3.2814 22.7314 175.6787 25.7305 25.4541 37.0569 11.4636 1.3727 13.6121 143.9825 231.8526 20.1808 114.7930 5.2392 6.4608 33.7016 18.8078 5.3371 11.0208 10.7698 0.2964 0.0620 12.4078
temp: 298.150 k
press: 1.00000 atm
elementType: 9 9 9 8 8 8 8 8 7 6 6 6 6 6 6 6 6 6 6 6 6 6 6 1 1 1 1 1 1 1 1 1 1
symmnumber: 1
zpe: 580195.0 jmol-1
zpe.correction: 0.220985 hartree
zpe.thermalcorrener: 0.240738 hartree
zpe.thermalcorrenthalpy: 0.241683 hartree
zpe.thermalcorrgfe: 0.169893 hartree
zpe.sumelectzpe: -1268.133030 hartree
zpe.sumelectthermal: -1268.113276 hartree
zpe.sumelectthermalent: -1268.112332 hartree
zpe.sumelectthermalfe: -1268.184122 hartree
dipole: -2.1723 -3.1829 -2.2934
dipole: 4.4843
quadrupole: -126.8761 -143.4152 -140.2635
quadrupole: 4.2427 6.9110 2.6029
quadrupole: 9.9755 -6.5635 -3.4119 4.2427 6.9110 2.6029
hfenergy: -1268.3540147 hartree
pointgroup: C01 [X(C14H10F3N1O5)]
dipole: 0.7255956 1.433583 -0.728716 debye
polarizability: 242.8303621|6.2957782|191.6833049|-1.3549005|1.9917247|115.5899803 unknown
InChI: InChI=1S/C14H10F3NO5/c15-14(16,17)7-4-5-8(9(6-7)18(22)23)13(21)12-10(19)2-1-3-11(12)20/h4-6,12H,1-3H2
charge 0 multiplicity 1
33 atoms
F  -5.244317 0.982738 -0.822266
F  -5.107983 -1.196402 -0.191165
F  -4.974757 0.452244 1.36156
O  2.102963 2.856057 1.568061
O  3.302898 -1.297624 1.635651
O  1.710108 0.617498 -1.756681
O  -0.777172 -3.32242 -0.452982
O  1.140738 -2.088924 -0.455912
N  -0.148375 -2.20344 -0.419903
C  2.072712 0.577445 0.688445
C  4.902409 1.30767 -0.063912
C  3.761708 2.358398 -0.178176
C  4.379404 -0.146196 -0.250071
C  2.611343 2.041503 0.760311
C  3.271558 -0.417681 0.747639
C  1.245386 0.435265 -0.599847
C  -0.257892 0.292802 -0.399968
C  -0.933539 -0.947739 -0.334656
C  -1.039419 1.472297 -0.32711
C  -3.081423 0.13993 -0.126041
C  -2.331715 -1.046688 -0.201404
C  -2.438866 1.401366 -0.187248
C  -4.576509 0.085817 0.047488
H  1.430333 0.398439 1.565949
H  5.660261 1.518649 -0.838528
H  5.400323 1.400418 0.919491
H  3.37087 2.33039 -1.215451
H  4.125223 3.376919 0.035898
H  5.184507 -0.884499 -0.105078
H  3.970867 -0.249393 -1.273866
H  -0.548461 2.448565 -0.376833
H  -2.802156 -2.032864 -0.166699
H  -3.03003 2.320661 -0.134493
