program: Gaussian 09
title: 000115349
version: EM64L-G09RevD.01
frameworkgroup: C1[X(C16H21NO2)]
method: RPBEPBE
basis: SDD
operation: Freq
keyword: #p
keyword: freq=noraman
keyword: PBEPBE/SDD
title: #p freq=noraman PBEPBE/SDD
converged: YES YES NO NO
title: Mulliken charges:
elementType: O O N C C C C C C C C C C C C C C C C H H H H H H H H H H H H H H H H H H H H H
charge: -0.269997 -0.443538 -0.059099 0.502338 -0.580915 0.389012 0.400779 -0.626624 -0.352676 -0.421871 -0.428672 -0.606976 0.356132 -0.421612 -0.373346 -0.251808 -0.395301 -0.598719 -0.678841 0.236181 0.213219 0.247885 0.221611 0.225564 0.233265 0.234249 0.260804 0.233685 0.248119 0.199912 0.199668 0.219043 0.218976 0.235658 0.213882 0.216341 0.209676 0.227449 0.209558 0.356990
chargesum: 0.00000
title: Mulliken charges with hydrogens summed into heavy atoms:
elementType: O O N C C C C C C C C C C C C C C C C
charge: -0.269997 -0.086548 -0.059099 0.502338 -0.131515 0.389012 0.400779 -0.378739 0.094499 -0.188606 -0.194422 -0.346173 0.356132 -0.187927 -0.125227 0.147771 0.042719 0.067162 -0.032158
polarizability: 3.18868719e+02 1.04155687e+01 1.79456412e+02 -1.24063112e+01 1.39499743e+01 1.18698137e+02
1716.lowfreq: -4.2261 -0.0009 -0.0007 -0.0004 2.0263 6.2123 22.6035 28.5677 37.9133
frequency: 21.3292 28.2511 37.8604 51.9501 77.7520 79.6816 112.8715 122.4817 143.7104 151.9521 188.4465 209.0434 219.8252 238.4717 267.1601 288.9190 292.4869 295.8962 312.5215 384.7781 397.5661 415.5565 432.3353 445.9877 467.6303 475.5688 517.2269 544.3590 602.9867 630.4528 656.9121 705.6760 739.0292 762.1934 767.3506 773.7518 780.0449 800.2144 803.8046 843.0289 865.9702 895.3991 898.8805 918.5243 930.0284 937.9533 945.0659 950.4600 969.5502 993.6013 1003.9236 1038.4522 1053.1172 1075.6062 1114.3466 1131.8431 1137.6128 1139.3328 1163.6866 1166.6970 1177.1143 1193.7654 1195.6086 1228.0675 1240.5518 1253.2504 1262.7932 1272.3354 1281.7922 1285.3213 1293.0742 1308.7932 1340.4164 1359.5153 1373.0658 1393.2708 1414.4473 1417.5930 1422.8544 1438.6808 1444.2227 1453.6730 1460.0992 1472.7141 1479.0354 1479.2647 1480.5565 1485.9335 1490.3102 1518.5420 1574.3841 1613.4383 1644.7425 2926.0100 2938.1094 2942.0978 2977.3919 2997.0268 3000.4917 3004.8067 3025.3698 3051.7696 3052.5355 3067.9919 3080.4310 3082.8761 3104.8081 3110.9307 3116.3051 3123.9836 3136.2494 3149.8706 3164.3723 3550.0910
redmass: 3.9714 3.9563 3.8998 3.8287 1.8216 3.5886 2.9840 2.6949 3.9741 3.4505 3.7990 3.2445 1.1628 1.1385 3.9342 2.1647 3.3803 4.5667 1.5394 3.2613 2.8929 2.7672 3.2280 3.3485 4.0488 2.5070 4.9274 5.8866 4.5467 6.8268 2.5892 5.8487 5.7915 4.9116 1.1150 2.8207 2.1275 1.6628 1.4358 1.6582 1.4261 1.1441 1.8980 2.0462 2.9239 2.9166 1.4386 2.9385 1.3978 3.1367 2.5957 2.3214 2.7851 1.9801 1.4295 1.7732 1.9450 1.4364 1.4271 1.3522 1.4920 1.8087 2.3439 1.2750 2.0785 1.2909 1.8242 1.7583 1.4186 1.1064 1.2647 1.3478 1.7348 1.3719 1.5516 1.2286 4.4288 1.1672 4.5006 3.2779 1.0994 1.0614 3.0071 1.0771 1.0544 1.0501 1.0703 1.1050 1.0978 3.4694 7.5907 6.1020 7.0232 1.0638 1.0456 1.0549 1.0363 1.0605 1.1065 1.0602 1.0933 1.1014 1.0880 1.1020 1.1031 1.0987 1.1005 1.0862 1.0915 1.0890 1.0975 1.0916 1.0942 1.0679
irintensity: 0.6272 0.8696 0.4944 0.3070 0.0248 0.3049 1.4943 0.1067 2.4839 0.0271 0.4647 3.7947 0.2745 2.4548 0.1547 47.0963 15.3438 8.5606 107.8858 1.4983 0.7076 12.4316 0.6324 1.5149 0.3486 23.6143 3.9661 5.8258 10.6478 1.8293 1.6936 20.6283 19.1218 0.4471 12.7325 2.0467 1.4888 1.5403 2.2041 65.4842 11.0533 4.5191 10.7839 24.4048 9.1261 8.3141 2.7723 22.9280 3.0293 65.2909 53.0835 4.2360 8.5734 31.5219 13.2376 51.5605 8.6704 0.3515 14.8930 131.2503 1.1738 26.8681 69.0714 0.2364 29.3064 43.2073 111.8668 11.8014 29.1342 0.0294 3.5178 0.5906 1.3921 9.0648 20.8867 24.0312 2.0543 3.4994 0.1899 22.8765 11.3644 12.7030 30.0108 9.1318 9.9068 10.7345 5.8679 9.3152 26.4406 89.0399 5.6579 37.5283 145.0322 27.1530 81.1237 46.0504 43.3895 32.3404 30.3358 23.1471 6.2996 0.0009 32.1258 23.9262 83.5947 44.4005 34.0197 5.0336 16.4661 9.7461 31.7748 4.5398 18.6871 17.6572
temp: 298.150 k
press: 1.00000 atm
elementType: 8 8 7 6 6 6 6 6 6 6 6 6 6 6 6 6 6 6 6 1 1 1 1 1 1 1 1 1 1 1 1 1 1 1 1 1 1 1 1 1
symmnumber: 1
zpe: 877878.7 jmol-1
zpe.correction: 0.334366 hartree
zpe.thermalcorrener: 0.353850 hartree
zpe.thermalcorrenthalpy: 0.354794 hartree
zpe.thermalcorrgfe: 0.284563 hartree
zpe.sumelectzpe: -826.022046 hartree
zpe.sumelectthermal: -826.002562 hartree
zpe.sumelectthermalent: -826.001618 hartree
zpe.sumelectthermalfe: -826.071849 hartree
dipole: -1.2308 1.4102 0.7518
dipole: 2.0171
quadrupole: -86.8459 -111.7807 -113.5787
quadrupole: 0.4324 -2.0107 3.5291
quadrupole: 17.2225 -7.7122 -9.5103 0.4324 -2.0107 3.5291
hfenergy: -826.3564122 hartree
pointgroup: C01 [X(C16H21N1O2)]
dipole: -0.491754 0.5532968 0.2860613 debye
polarizability: 319.338433|10.2141683|179.3591745|-7.4812161|14.436249|118.3256603 unknown
InChI: InChI=1S/C16H21NO2/c1-3-10-19-16-7-6-14-5-4-13(8-9-17(2)18)11-15(14)12-16/h4-7,11-12,18H,3,8-10H2,1-2H3
charge 0 multiplicity 1
40 atoms
O  -3.727436 -1.001382 -0.288908
O  5.658931 -2.11431 -0.514845
N  5.741782 -0.78267 0.21793
C  2.217402 0.54107 -0.617594
C  3.613212 -0.009585 -0.864748
C  -0.22936 0.219904 -0.40726
C  -0.384877 1.622464 -0.069658
C  1.088855 -0.283663 -0.675881
C  4.327144 -0.373812 0.457233
C  2.046398 1.929507 -0.279324
C  0.781943 2.454154 -0.015022
C  -1.386418 -0.614606 -0.466555
C  -2.659386 -0.092418 -0.20327
C  -1.699108 2.123181 0.192011
C  -2.821434 1.293927 0.130178
C  -5.091686 -0.507134 -0.027344
C  -6.037636 -1.699297 -0.192319
C  6.444563 -1.094786 1.489705
C  -7.508054 -1.299042 0.058382
H  3.567316 -0.918668 -1.490285
H  4.237444 0.734427 -1.39585
H  1.204797 -1.343741 -0.935989
H  3.758822 -1.172469 0.986176
H  4.368193 0.512239 1.120327
H  2.930246 2.578592 -0.242718
H  0.664084 3.515991 0.234192
H  -1.293063 -1.675794 -0.72008
H  -1.821619 3.182924 0.446514
H  -3.813209 1.706723 0.335745
H  -5.344249 0.299461 -0.747803
H  -5.152105 -0.095214 1.002264
H  -5.919678 -2.108447 -1.212906
H  -5.731372 -2.496369 0.510385
H  7.463708 -1.444339 1.261164
H  5.923204 -1.871808 2.09024
H  6.511845 -0.163611 2.081156
H  -7.840689 -0.51872 -0.65191
H  -8.176284 -2.169628 -0.063454
H  -7.650785 -0.907195 1.083133
H  6.142055 -1.914358 -1.358912
