program: Gaussian 09
title: 000115347
version: EM64L-G09RevD.01
frameworkgroup: C1[X(C8H11NOS)]
method: RPBEPBE
basis: SDD
operation: Freq
keyword: #p
keyword: freq=noraman
keyword: PBEPBE/SDD
title: #p freq=noraman PBEPBE/SDD
converged: YES YES NO NO
title: Mulliken charges:
elementType: S O N C C C C C C C C H H H H H H H H H H H
charge: 0.153207 -0.433146 -0.586970 -0.596632 -0.218864 -0.347843 -0.183885 -0.209743 -0.332247 -0.369989 0.291825 0.248427 0.274110 0.221357 0.203069 0.251930 0.253101 0.253397 0.221429 0.269691 0.283921 0.353853
chargesum: 0.00000
title: Mulliken charges with hydrogens summed into heavy atoms:
elementType: S O N C C C C C C C C
charge: 0.153207 -0.079293 -0.033358 -0.074095 -0.218864 0.076584 0.068045 0.043358 -0.078850 -0.148560 0.291825
polarizability: 1.71607124e+02 2.27887065e+00 9.33058752e+01 -9.74016014e+00 1.15995120e+01 8.30441996e+01
1716.lowfreq: -6.5280 -0.0017 0.0008 0.0010 3.6359 13.3972 15.6796 39.7947 49.5608
frequency: 15.6292 39.6817 49.5507 110.2415 138.2015 179.1159 219.4281 238.4343 309.5790 360.7828 371.8849 395.1537 397.9062 413.5775 512.7639 537.3140 613.1518 629.3634 694.1940 714.1003 780.7048 800.2895 804.8516 833.2433 933.0140 937.2393 961.6333 995.6975 1014.8572 1071.9539 1076.0583 1091.8175 1108.7541 1143.1203 1172.0013 1219.0837 1244.4123 1258.7328 1288.6366 1299.1467 1376.2699 1379.1939 1409.6924 1451.4156 1476.3702 1485.7047 1586.2274 1609.7237 1637.7335 2901.6205 3022.8808 3041.7667 3111.1114 3115.8562 3146.6157 3158.4291 3174.2069 3488.8012 3581.9444 3620.0146
redmass: 4.3248 1.7475 5.8729 2.7660 5.5592 1.1203 3.9937 7.0557 5.4397 1.1204 4.5994 8.4646 4.2653 2.9959 2.5552 1.3122 7.5775 7.0949 4.5962 4.2133 1.1069 6.3466 1.3443 1.4970 1.3695 1.3520 1.3478 3.7280 1.9228 2.5372 1.6860 1.4288 2.5663 1.3735 1.1040 1.2730 2.5653 1.3110 1.3395 1.1124 1.3709 5.1831 3.0973 1.0882 2.5611 1.0841 6.7892 6.3002 1.0948 1.0708 1.0607 1.0872 1.1080 1.0896 1.0892 1.0950 1.0967 1.0449 1.0660 1.0992
irintensity: 1.4949 1.0835 0.6531 0.8678 0.8635 69.6375 2.5353 4.2017 4.2224 134.9826 23.5923 8.3504 6.5192 0.3237 54.0468 226.7999 14.6185 1.2545 19.7031 7.3064 6.4680 10.3915 28.7805 51.1420 1.9474 0.8024 0.0793 9.8920 5.1231 2.5021 2.1828 45.2846 60.9821 234.8920 8.9357 6.7321 33.3189 6.7507 7.8016 2.0280 8.0062 22.3396 12.9304 6.7197 94.3994 3.4257 23.9148 31.6755 35.0596 82.4871 15.9274 27.5553 22.8774 19.5489 4.8141 7.2339 5.4561 0.3422 42.5750 2.5447
temp: 298.150 k
press: 1.00000 atm
elementType: 16 8 7 6 6 6 6 6 6 6 6 1 1 1 1 1 1 1 1 1 1 1
symmnumber: 1
zpe: 459072.2 jmol-1
zpe.correction: 0.174851 hartree
zpe.thermalcorrener: 0.187021 hartree
zpe.thermalcorrenthalpy: 0.187965 hartree
zpe.thermalcorrgfe: 0.134252 hartree
zpe.sumelectzpe: -838.632762 hartree
zpe.sumelectthermal: -838.620593 hartree
zpe.sumelectthermalent: -838.619648 hartree
zpe.sumelectthermalfe: -838.673362 hartree
dipole: 0.7105 0.6588 2.2863
dipole: 2.4831
quadrupole: -54.5982 -75.9994 -70.3679
quadrupole: -6.2863 -3.6138 6.8952
quadrupole: 12.3903 -9.0109 -3.3794 -6.2863 -3.6138 6.8952
hfenergy: -838.8076133 hartree
pointgroup: C01 [X(C8H11N1O1S1)]
dipole: 0.2884068 -0.7913075 -0.4950253 debye
dipolederiv: -0.2609607 -0.0142812 0.0771422 -0.0758076 -0.1863268 -0.0109104 0.1964551 -0.0102474 -0.0238726 -1.4954891 0.05471 -0.318964 0.0819973 -0.0697637 -0.014661 -0.4105474 -0.0186469 -0.5455568 -0.7891829 0.1271472 0.0800399 0.0271037 -0.3977724 0.2555616 0.1892528 0.2668924 -0.6819054 0.0401991 0.0261208 -0.2071954 0.0875183 0.1304556 0.0292817 -0.5094667 0.0119921 0.2111112 0.4446235 -0.0309223 0.1121039 -0.0084193 -0.145977 0.0210207 0.1074275 0.0026464 -0.1778131 0.6100028 0.0037419 -0.2682803 -0.0610605 0.2981079 -0.0859096 0.079857 -0.1383694 0.3935331 -0.042534 -0.0099312 0.0582439 -0.0430258 0.1111 -0.0127217 -0.0026013 -0.0247013 -0.0881713 -0.0531691 0.0609633 0.0399444 0.0590912 0.0909587 -0.021287 0.0313129 0.0055223 -0.0775649 -0.3325395 0.0111895 -0.0350639 -0.2226298 0.0343937 -0.0906579 -0.0314807 -0.016314 -0.1745632 -0.3408528 0.0164014 -0.0244603 0.2938699 -0.0136353 0.0719201 -0.0702501 -0.0130114 -0.2150957 1.3770959 -0.0172997 0.4236686 -0.0371534 0.084963 -0.006393 0.4852727 -0.0058321 0.2423811 0.001717 -0.0412463 0.0276536 -0.0256818 -0.0463283 -0.1024187 0.0477328 -0.0844536 -0.0723977 0.01269 0.0534047 0.0122146 0.0670692 -0.0333034 0.0736479 -0.0014918 0.069799 -0.0324365 0.0649853 -0.0372378 0.0004081 -0.0734681 -0.0725563 -0.1000518 -0.0177694 -0.0816751 -0.0113607 -0.0075867 0.0286634 0.0257054 0.048511 -0.105849 0.1824595 -0.0087335 0.1354209 -0.1342063 0.063832 -0.0950292 -0.0316846 -0.0801374 -0.0072842 -0.0099882 -0.0276278 -0.0137263 0.1299641 0.0901829 0.0701652 -0.0376948 0.0602281 -0.0242715 0.0315433 -0.0324535 0.0360814 0.1258724 0.047601 0.0599902 -0.04437 0.065979 -0.0191816 0.0377207 -0.0487023 0.0412346 0.1543896 -0.0423731 -0.1097165 -0.0574962 -0.105621 -0.0322442 -0.0125508 -0.0687704 -0.0186869 0.1552344 0.230675 -0.0370749 0.0954625 -0.0266103 0.0714646 -0.1377964 0.0900053 -0.0750046 0.2210893 -0.0331601 -0.1058646 0.0723179 0.0216209 0.2783754 -0.1109707 -0.0157878 -0.0997121 0.2175384 0.4142434 -0.0138941 0.0003044 -0.0533737 0.0546748 0.0131616 0.0183667 0.0307919 0.3838308 unknown
polarizability: 171.217107|4.7006395|100.2863504|10.7749297|-3.6291239|76.4537412 unknown
InChI: InChI=1S/C8H11NOS/c9-5-6-11-8-3-1-7(10)2-4-8/h1-4,10H,5-6,9H2
charge 0 multiplicity 1
22 atoms
S  1.540781 -0.240807 1.344621
O  -4.108159 0.165475 -0.85377
N  4.835374 0.064591 -1.16716
C  2.548516 -0.079542 -0.272358
C  -0.164538 -0.139037 0.649629
C  4.047078 -0.016049 0.074861
C  -0.734061 1.116586 0.320237
C  -0.930828 -1.315557 0.482263
C  -2.047068 1.199215 -0.1845
C  -2.251836 -1.244397 -0.0146
C  -2.804081 0.015475 -0.350724
H  2.316269 -0.956419 -0.901548
H  2.233953 0.837697 -0.794204
H  4.238204 0.897042 0.668032
H  4.309674 -0.88414 0.724835
H  -0.149258 2.03032 0.469367
H  -0.494721 -2.285014 0.743281
H  -2.499605 2.160746 -0.443491
H  -2.840748 -2.1627 -0.138484
H  4.884676 -0.800747 -1.709853
H  5.735211 0.542039 -1.09033
H  -4.561332 -0.710979 -0.926204
