program: Gaussian 09
title: 000115344
version: EM64L-G09RevD.01
frameworkgroup: C1[X(C21H21IN8O3)]
method: RPBEPBE
basis: SDD
operation: Freq
keyword: #p
keyword: freq=noraman
keyword: PBEPBE/SDD
title: #p freq=noraman PBEPBE/SDD
converged: YES YES NO NO
title: Mulliken charges:
elementType: I O O O N N N N N N N N C C C C C C C C C C C C C C C C C C C C C H H H H H H H H H H H H H H H H H H H H H
charge: 0.132509 -0.276425 -0.296922 -0.301653 -0.140220 -0.134899 -0.116174 -0.130868 -0.639029 -0.069147 0.004597 -0.044662 -0.377354 -0.373364 -0.411309 -0.378052 0.051199 0.127979 0.291383 0.097013 0.291753 0.099937 -0.543798 -0.265414 -0.364868 -0.486474 0.255624 0.168153 -0.491313 -0.340424 0.374716 -0.529977 -0.529363 0.212045 0.278242 0.265924 0.217416 0.245856 0.252349 0.263876 0.224884 0.278848 0.270424 0.273232 0.220414 0.263164 0.330178 0.330333 0.225917 0.255602 0.231275 0.221894 0.254696 0.230277
chargesum: 0.00000
title: Mulliken charges with hydrogens summed into heavy atoms:
elementType: I O O O N N N N N N N N C C C C C C C C C C C C C C C C C C C C C
charge: 0.132509 -0.276425 -0.296922 -0.301653 -0.140220 -0.134899 -0.116174 -0.130868 0.021483 -0.069147 0.004597 -0.044662 0.112933 0.109976 0.086895 0.110708 0.051199 0.127979 0.291383 0.097013 0.291753 0.099937 -0.264950 0.005010 -0.091636 -0.266060 0.255624 0.168153 -0.491313 -0.077260 0.374716 0.182817 0.177503
polarizability: 5.21111614e+02 -5.79790851e+00 3.92763051e+02 1.28217480e+01 -1.59268153e+00 1.98922875e+02
1716.lowfreq: -4.2735 -0.0009 -0.0006 -0.0002 0.4102 2.1115 10.1142 13.0883 18.5498
frequency: 9.8227 13.0683 18.3749 21.0521 34.4503 46.7683 52.0642 67.3574 73.1432 89.0896 106.3413 110.4579 118.9236 125.3530 136.3548 143.9016 158.0470 170.4238 176.2258 186.7780 196.8980 211.0608 218.3088 246.3121 250.4225 258.7627 272.8129 278.7152 295.6395 315.0575 323.4303 332.0923 363.8616 377.2988 387.0363 408.1888 418.9398 432.3098 441.8140 442.5620 449.2405 458.1223 477.1795 478.7266 500.2467 518.3240 541.4733 545.1277 561.9202 575.3384 593.5081 626.8636 642.5345 647.4116 652.3270 672.6840 683.9961 702.7242 707.1807 708.9197 731.7007 742.1039 777.8790 783.2903 786.4603 841.8157 851.7357 852.8889 867.2723 879.3088 893.3126 905.2147 916.5871 937.3605 951.1097 970.2139 977.1222 1002.9481 1014.7341 1028.1140 1047.6455 1062.2032 1084.6798 1104.5470 1111.9486 1114.9833 1121.3879 1129.3873 1141.8664 1149.8882 1153.1006 1155.4267 1160.4460 1190.2486 1197.1781 1221.1492 1226.1663 1243.7122 1255.1076 1265.1900 1269.7125 1306.0567 1323.1483 1325.8463 1331.3710 1340.9685 1352.0899 1354.1763 1359.4896 1367.5935 1386.0927 1394.3058 1404.4755 1422.5628 1434.2663 1455.8608 1457.7433 1460.9624 1462.1333 1465.9166 1466.2437 1470.5055 1476.6227 1477.5102 1486.0714 1487.8322 1502.5794 1530.0104 1532.1129 1552.7301 1558.7723 1596.2634 1624.6590 1628.6330 2049.0953 2948.7383 2962.3475 2971.7854 2972.1585 2975.2181 2982.2201 3069.9729 3073.6015 3090.8186 3094.4805 3102.1127 3103.0661 3121.6188 3124.6368 3133.6841 3155.2947 3159.0992 3178.7413 3179.0490 3554.6193 3709.3815
redmass: 8.6455 13.1254 5.8282 8.6773 6.4839 5.0848 5.3530 3.7888 6.4307 4.4676 3.3591 3.9157 13.1306 8.7252 5.4584 3.9657 1.3147 1.5760 1.5764 4.0389 9.1783 5.3521 5.5089 6.1338 4.7603 4.3280 5.5184 4.6170 7.1527 3.6699 4.9549 3.3000 5.3754 2.6070 1.6571 4.9437 2.1641 5.3240 3.4715 3.9362 5.4549 2.6847 5.5851 3.6291 7.0197 5.1928 1.3955 4.0619 5.0340 5.3880 4.0373 5.3451 4.4677 4.3436 6.8194 4.1680 5.4857 9.2726 6.8134 6.4441 3.3265 4.1137 6.0689 5.2085 5.2775 1.6087 1.5087 4.9722 1.7954 3.8699 1.6009 1.5175 6.5110 2.8636 4.3916 2.5219 1.3811 3.1598 3.2445 2.4432 1.7316 4.3160 2.3112 3.7270 1.2700 1.2514 1.7898 2.7766 1.6798 1.4201 2.5358 1.9627 1.7841 2.4942 1.0961 2.9081 1.4678 1.8098 1.7480 1.6777 1.7468 5.3639 1.2594 5.5173 2.8729 1.3873 2.6085 1.6376 1.7933 3.1105 5.3835 5.4172 3.1455 1.2325 1.2680 1.3957 1.0974 1.1831 1.1279 1.2705 1.5935 1.6808 1.5500 1.0777 2.5998 1.1809 5.8534 8.0024 4.4327 7.4109 8.3421 6.5521 1.4309 6.9091 13.9802 1.0698 1.0700 1.0311 1.0694 1.0309 1.0673 1.1034 1.1042 1.0929 1.0950 1.0929 1.0925 1.1029 1.1030 1.0908 1.0917 1.0883 1.0923 1.0977 1.0455 1.1036
irintensity: 0.0042 0.0061 0.3018 0.0257 0.1007 0.3992 0.2489 5.3695 2.3555 2.7338 6.0160 8.0522 0.2951 0.9216 2.2000 3.9483 0.5851 0.4058 1.2580 7.1779 1.1127 1.7353 1.3720 7.3936 4.0379 11.1531 1.8918 2.1829 7.3704 4.8226 5.5192 4.2544 3.4531 24.5222 56.6725 22.4486 12.0528 6.4494 26.6689 41.7758 8.8413 1.7229 8.6195 23.9399 24.0476 3.4049 65.2457 17.3208 18.7839 2.4481 6.9900 2.4599 16.2852 10.2480 17.4895 0.8736 4.5241 3.3608 6.0081 7.4114 9.8491 16.0867 13.8549 5.8477 23.3388 0.6418 40.7882 12.8127 14.5545 1.5576 20.7553 19.2366 48.9820 73.1414 102.5802 8.3902 1.9220 221.3957 59.4038 2.9063 6.3917 39.4014 14.6343 6.6288 54.1100 9.4593 61.0131 40.0217 2.8002 3.4571 11.6465 0.5729 18.0571 48.7246 1.5152 135.1419 27.6646 555.0390 149.0244 8.3090 44.9606 34.7676 0.7513 44.5054 6.3487 32.3177 8.2970 37.2231 68.0027 31.8965 37.0292 5.7267 440.3397 2.7068 18.1060 61.8206 5.4357 124.7333 52.4898 28.8879 93.6891 56.9744 18.0644 5.3029 422.4443 199.4868 27.2418 88.8833 432.5706 875.0030 68.9259 43.7824 369.8163 141.8310 599.7997 61.6148 56.2750 92.4646 57.8386 78.6480 101.9181 27.4771 22.4878 7.3713 6.7957 7.0338 23.7421 28.9918 24.1175 12.5735 3.0798 1.1165 0.7983 2.6102 84.4074 31.7356
temp: 298.150 k
press: 1.00000 atm
elementType: 53 8 8 8 7 7 7 7 7 7 7 7 6 6 6 6 6 6 6 6 6 6 6 6 6 6 6 6 6 6 6 6 6 1 1 1 1 1 1 1 1 1 1 1 1 1 1 1 1 1 1 1 1 1
symmnumber: 1
zpe: 1062869.2 jmol-1
zpe.correction: 0.404826 hartree
zpe.thermalcorrener: 0.436060 hartree
zpe.thermalcorrenthalpy: 0.437004 hartree
zpe.thermalcorrgfe: 0.337424 hartree
zpe.sumelectzpe: -1485.591922 hartree
zpe.sumelectthermal: -1485.560688 hartree
zpe.sumelectthermalent: -1485.559743 hartree
zpe.sumelectthermalfe: -1485.659324 hartree
dipole: -6.6874 0.3523 0.0846
dipole: 6.6972
quadrupole: -184.9875 -208.2294 -201.0827
quadrupole: -7.5740 3.5291 0.6371
quadrupole: 13.1124 -10.1295 -2.9828 -7.5740 3.5291 0.6371
hfenergy: -1485.9967478 hartree
pointgroup: C01 [X(C21H21I1N8O3)]
dipole: -2.6081796 0.3193691 0.1948007 debye
polarizability: 519.7749562|-16.3907332|385.7774443|-1.561079|40.6728548|207.2451392 unknown
InChI: InChI=1S/C21H21IN8O3/c1-32-17-10-13-16(11-18(17)33-2)25-21(26-19(13)23)30-7-5-29(6-8-30)20(31)12-3-4-15(27-28-24)14(22)9-12/h3-4,9-11H,5-8,23H2,1-2H3
charge 0 multiplicity 1
54 atoms
I  5.378044 -2.370051 -2.088687
O  3.987776 3.381659 0.767974
O  -5.91976 -3.151466 0.301868
O  -7.772735 -0.902963 0.127088
N  -0.362598 1.334312 -0.529887
N  2.230315 1.871636 0.506794
N  -2.177964 -0.138351 -0.25547
N  -2.526061 2.259788 -0.615213
N  -4.629139 3.233857 -0.710518
N  7.777048 -1.784129 0.485875
N  7.933072 -2.891833 -0.107566
N  8.344494 -3.933193 -0.499557
C  0.588695 0.223029 -0.372733
C  0.242131 2.660276 -0.740894
C  1.597159 0.553349 0.750084
C  1.250224 2.977497 0.385765
C  -1.735121 1.129647 -0.46127
C  3.581799 2.179603 0.639375
C  4.591401 1.059329 0.584708
C  -3.550566 -0.305081 -0.182422
C  -4.475175 0.798591 -0.314555
C  -3.865271 2.099057 -0.547896
C  -4.080392 -1.618312 0.011371
C  4.538267 0.037956 -0.395104
C  5.712303 1.115417 1.451095
C  -5.87464 0.565936 -0.194728
C  -5.457544 -1.834447 0.090893
C  -6.37218 -0.721651 0.022224
C  5.559281 -0.931539 -0.495719
C  6.71603 0.142242 1.372912
C  6.661776 -0.909146 0.409957
C  -6.788225 -3.689488 -0.773558
C  -8.226627 -1.3830 1.455396
H  1.134904 0.060761 -1.326612
H  0.012423 -0.684423 -0.134123
H  -0.567002 3.405437 -0.762112
H  0.771093 2.677538 -1.716571
H  1.05149 0.596725 1.715659
H  2.363367 -0.231518 0.828258
H  1.808412 3.904631 0.179493
H  0.708365 3.101088 1.34552
H  -3.392496 -2.464573 0.081431
H  3.714195 0.019033 -1.11456
H  5.785311 1.936169 2.170265
H  -6.610822 1.376251 -0.24628
H  7.577534 0.159104 2.046826
H  -4.144188 4.113551 -0.875571
H  -5.643707 3.209343 -0.713363
H  -6.209422 -3.78159 -1.711776
H  -7.667329 -3.040568 -0.934356
H  -7.098458 -4.686121 -0.425184
H  -7.998486 -0.626279 2.22998
H  -7.742342 -2.341839 1.713779
H  -9.315955 -1.511551 1.364496
