program: Gaussian 09
title: 000115223
version: EM64L-G09RevD.01
frameworkgroup: C1[X(C16H18O3)]
method: RPBEPBE
basis: SDD
operation: Freq
keyword: #pfreq=noraman
keyword: PBEPBE/SDD
title: #p freq=noraman PBEPBE/SDD
converged: NO YES NO NO
title: Mulliken charges:
elementType: O O O C C C C C C C C C C C C C C C C H H H H H H H H H H H H H H H H H H
charge: -0.252662 -0.229961 -0.230594 0.129317 -0.303120 -0.309125 -0.309882 -0.441416 0.088627 -0.388873 0.426990 -0.689480 -0.407531 -0.315040 -0.376270 -0.386985 0.301653 0.113297 -0.472345 0.212145 0.212184 0.216721 0.210897 0.211326 0.217038 0.199042 0.199216 0.209697 0.208866 0.212391 0.212428 0.224750 0.275900 0.255276 0.248126 0.247803 0.279593
chargesum: 0.00000
title: Mulliken charges with hydrogens summed into heavy atoms:
elementType: O O O C C C C C C C C C C C C C C C C
charge: -0.252662 -0.229961 -0.230594 0.129317 0.121209 0.118493 0.118482 -0.043158 0.088627 0.029689 0.426990 -0.039911 -0.131631 -0.059764 -0.128144 -0.139182 0.301653 0.113297 -0.192751
polarizability: 3.00860243e+02 5.13271501e+00 1.50227756e+02 -4.56149798e-02 7.36188552e-02 1.08978024e+02
1716.lowfreq: -103.2902 -16.8767 -5.6920 -4.1898 -0.0005 -0.0003 0.0006 19.9468 41.8974
frequency: -103.2792 -14.0951 41.7653 49.4852 61.0110 83.4919 120.1160 141.7410 165.6873 216.7909 220.6508 242.9698 275.0596 277.9684 307.3223 324.8944 357.6557 402.5803 402.8123 420.3929 463.0823 484.3773 515.9171 532.9977 548.4143 555.6536 566.0743 613.1489 634.8627 637.2714 647.4112 705.0080 733.8470 739.3373 768.1696 823.1009 826.6046 852.7192 855.3549 880.2740 889.6370 896.8407 921.4797 924.6325 930.8005 967.2472 972.7058 974.7740 980.1291 989.7146 1011.0676 1051.7455 1055.2819 1067.2791 1091.9228 1117.3057 1137.4714 1149.2903 1156.0095 1159.9632 1187.7629 1205.0110 1222.2412 1252.8324 1286.7832 1300.8075 1310.6830 1313.3302 1326.2174 1326.6104 1330.3446 1358.2580 1364.0909 1367.6197 1392.7295 1407.6742 1462.6082 1471.5216 1473.8235 1475.4970 1477.7305 1485.8972 1496.0741 1505.0242 1568.9999 1624.8545 2129.3388 2955.7722 2976.4840 2980.8285 2983.8882 2984.8618 2990.9844 3002.6465 3036.3960 3041.8641 3049.7753 3053.4147 3074.4142 3078.8266 3149.5099 3152.3515 3174.5748 3183.2182 3430.7789
redmass: 2.9425 3.8850 5.1904 1.6376 4.7139 3.6522 3.9774 4.6045 4.1172 5.7128 1.1917 2.0631 3.7491 2.6828 4.2773 5.2289 2.7707 2.8755 3.2205 3.9185 5.1367 5.5745 6.0406 6.4961 6.2577 8.0253 3.2139 1.2449 4.6481 4.8435 1.3018 7.5043 1.4956 2.0297 5.9328 2.5980 4.3942 1.3028 1.3443 2.4622 3.1071 3.6988 5.0529 1.3935 6.9348 1.8399 1.4532 2.4413 4.2866 1.3743 3.6731 3.0782 3.7520 1.4888 2.1011 1.3654 1.5894 1.2594 1.0821 3.0773 1.1752 3.0400 1.4375 1.7003 1.2657 1.2843 1.5290 3.9014 1.3888 1.4141 1.2988 4.7481 1.5340 1.3828 1.2112 3.6869 1.0787 1.0726 1.0695 1.0704 1.0420 1.0848 1.1113 2.7463 7.4455 6.3944 6.2684 1.0591 1.0359 1.0572 1.0576 1.0589 1.0597 1.0998 1.1042 1.1068 1.1085 1.1076 1.1012 1.0993 1.0888 1.0897 1.0965 1.0957 1.1556
irintensity: 0.0119 0.0056 0.7511 0.0154 0.6451 0.7279 1.1430 1.0735 0.7729 0.2096 0.0811 0.7688 12.4748 6.3510 9.5929 4.8400 0.6051 0.1177 3.7667 0.1026 1.2447 0.0272 0.6396 3.3155 1.3014 1.0221 11.1183 66.5957 4.3881 2.3064 66.6455 5.3481 0.0040 15.2868 0.0442 232.2747 0.6736 0.1799 17.8062 6.2869 57.7832 83.2648 15.6559 0.3817 19.8583 6.4758 3.4215 26.3972 21.0005 0.0783 95.4611 19.1016 153.0166 0.0773 24.2415 3.8566 0.7495 0.0153 0.1013 24.5453 15.4952 0.3530 0.0116 3.6873 0.0011 1.6067 0.0931 232.2289 14.1375 2.8332 2.0627 1.1427 0.4493 32.5291 9.5961 10.2715 1.3671 5.2889 5.0225 6.4303 12.8303 10.5765 4.6014 2.7467 1.1058 5.9757 10.6410 17.6909 42.9697 20.6680 47.7444 94.5316 85.0791 6.7831 8.1428 24.9426 31.1709 49.8383 73.5115 44.1949 6.0851 7.4115 8.0940 1.2350 100.2434
temp: 298.150 k
press: 1.00000 atm
elementType: 8 8 8 6 6 6 6 6 6 6 6 6 6 6 6 6 6 6 6 1 1 1 1 1 1 1 1 1 1 1 1 1 1 1 1 1 1
symmnumber: 1
zpe: 785744.8 jmol-1
zpe.correction: 0.299274 hartree
zpe.thermalcorrener: 0.315560 hartree
zpe.thermalcorrenthalpy: 0.316504 hartree
zpe.thermalcorrgfe: 0.255587 hartree
zpe.sumelectzpe: -844.678317 hartree
zpe.sumelectthermal: -844.662032 hartree
zpe.sumelectthermalent: -844.661088 hartree
zpe.sumelectthermalfe: -844.722004 hartree
dipole: 5.4796 0.2011 -0.0040
dipole: 5.4833
quadrupole: -91.8224 -107.3776 -117.5546
quadrupole: 0.9821 -0.0137 0.0247
quadrupole: 13.7625 -1.7927 -11.9698 0.9821 -0.0137 0.0247
hfenergy: -844.9775918 hartree
pointgroup: C01 [X(C16H18O3)]
dipole: 2.1568165 -0.0455833 0.0005575 debye
polarizability: 300.9834802|-2.7868306|150.1000627|-0.0338019|0.4351143|108.9824812 unknown
InChI: InChI=1S/C16H18O3/c1-3-9-15-10-17-16(18-11-15,19-12-15)14-7-5-13(4-2)6-8-14/h2,5-8H,3,9-12H2,1H3
charge 0 multiplicity 1
37 atoms
O  0.660588 -1.574662 -0.006312
O  0.73337 0.50624 -1.196782
O  0.733668 0.495773 1.202397
C  2.775108 -0.253906 -0.00066
C  2.146493 -1.67051 0.007754
C  2.227644 0.478465 -1.249152
C  2.228641 0.49306 1.23959
C  4.320047 -0.371719 -0.000521
C  0.231258 -0.184245 0.000018
C  5.111199 0.95926 0.002072
C  -1.276643 -0.104579 0.000502
C  6.635949 0.716521 -0.002104
C  -2.075717 -1.269019 -0.013118
C  -1.889274 1.170759 0.014191
C  -3.480146 -1.162552 -0.012923
C  -3.291564 1.282723 0.014413
C  -4.108784 0.115169 0.000835
C  -5.54157 0.226196 0.001246
C  -6.77335 0.322073 0.001691
H  2.451405 -2.245813 -0.887284
H  2.43781 -2.229122 0.917952
H  2.569825 1.528337 -1.292312
H  2.522208 -0.041709 -2.18094
H  2.538528 -0.00603 2.177735
H  2.556522 1.548326 1.260743
H  4.624934 -0.964151 -0.888762
H  4.624474 -0.966842 0.88611
H  4.842021 1.560549 0.892339
H  4.838156 1.566513 -0.882948
H  6.950412 0.13917 0.88758
H  6.946934 0.147979 -0.898646
H  7.192849 1.670735 0.001535
H  -1.590017 -2.247868 -0.023519
H  -1.261794 2.066508 0.025132
H  -4.101941 -2.063395 -0.023295
H  -3.76785 2.26818 0.02519
H  -7.844291 0.405187 0.002353
