program: Gaussian 09
title: 000115214
version: EM64L-G09RevD.01
frameworkgroup: C1[X(C14H9F3N4O)]
method: RPBEPBE
basis: SDD
operation: Freq
keyword: #p
keyword: freq=noraman
keyword: PBEPBE/SDD
title: #p freq=noraman PBEPBE/SDD
converged: YES YES NO NO
title: Mulliken charges:
elementType: F F F O N N N N C C C C C C C C C C C C C C H H H H H H H H H
charge: -0.161259 -0.160940 -0.168726 -0.297342 -0.339166 -0.025969 -0.183138 -0.084518 0.420906 0.344967 -0.456759 -0.374005 -0.361899 -0.186581 0.309645 0.253561 0.404544 -0.303053 -0.402391 -0.224829 -0.194777 -0.239726 0.312684 0.302556 0.270305 0.246882 0.328441 0.259417 0.236848 0.238251 0.236072
chargesum: 0.00000
title: Mulliken charges with hydrogens summed into heavy atoms:
elementType: F F F O N N N N C C C C C C C C C C C C C C
charge: -0.161259 -0.160940 -0.168726 -0.297342 -0.339166 -0.025969 -0.183138 -0.084518 0.420906 0.344967 -0.144075 -0.071449 -0.091594 0.060301 0.309645 0.253561 0.404544 0.025388 -0.142974 0.012019 0.043474 -0.003654
polarizability: 2.62996787e+02 1.46240080e+01 2.18020984e+02 -5.13764972e+00 1.37051241e+00 7.58691217e+01
1716.lowfreq: -3.4790 -1.7438 -0.0005 -0.0001 0.0005 2.1467 12.9195 19.9753 31.7800
frequency: 12.6256 19.9603 31.7607 46.1727 57.8313 100.9632 124.2263 132.3101 181.5210 218.1340 247.7055 253.0504 269.5505 301.7704 315.1570 334.5522 345.7652 396.9566 412.3302 427.7631 468.6921 488.5441 491.9104 527.7840 603.1192 607.0595 609.5529 617.5089 655.0009 661.7629 687.9415 692.3807 697.7524 699.5985 763.2751 765.6537 817.5336 827.1445 843.9465 907.2744 924.2564 930.0708 941.9705 955.5025 981.1090 986.4158 987.3199 989.8170 1001.3628 1003.5722 1004.4020 1014.7479 1020.9723 1036.0196 1071.2475 1084.2143 1110.9580 1139.6220 1172.7589 1175.0174 1189.9560 1191.4421 1213.8828 1282.5430 1315.5548 1318.9262 1370.2807 1384.8578 1396.0867 1445.1142 1451.0666 1468.9879 1474.4490 1502.7467 1593.3045 1600.8116 1612.3341 1621.5736 3139.3763 3149.6167 3157.0255 3162.0451 3174.6298 3177.1536 3182.2561 3192.5775 3209.7006
redmass: 7.0818 12.2536 4.3263 8.3688 7.4399 6.5321 8.8326 7.5202 7.4989 5.8503 6.4162 7.8796 8.8656 7.0162 6.7390 8.0346 8.7663 9.4158 2.9556 5.3144 9.0986 5.3530 3.2694 9.2738 6.9885 9.4033 9.7087 7.4847 11.8912 7.9450 6.3634 2.9456 9.5192 2.2314 1.4382 8.7647 1.4671 8.5635 1.2512 12.6514 1.4353 1.4015 1.4068 11.9637 1.3551 6.4013 6.8828 9.0912 1.3051 6.8280 1.4743 6.0452 2.8369 4.7200 2.7269 1.5246 1.7147 3.6007 1.2318 3.0378 1.2652 1.1216 4.0005 4.4517 1.3333 1.3344 5.2507 9.8842 8.7842 2.7683 3.1672 2.7378 2.8959 4.1078 6.1505 6.7807 6.9084 6.2213 1.0857 1.0898 1.0884 1.0945 1.0987 1.0949 1.0985 1.0970 1.0922
irintensity: 2.8392 0.5560 0.3906 0.7635 0.1952 0.8256 3.1241 0.0830 0.8034 0.3322 0.3818 1.6267 2.8392 1.1091 1.2419 2.1575 4.6198 5.9494 0.0045 0.4263 0.7741 8.2701 6.4997 0.3679 0.8683 12.2854 6.1582 0.8294 1.7747 15.3189 2.8578 15.7589 2.6699 32.7968 99.2879 24.6552 63.4702 27.1856 0.6488 8.7841 14.0069 48.1160 0.2966 102.5177 0.5549 11.0450 38.2743 172.2849 2.2980 90.8839 4.6200 115.6326 42.0576 1.1191 54.6628 10.7585 3.8148 91.6171 1.7850 22.0112 34.2215 1.7883 104.3585 191.7219 7.8128 5.7907 79.4307 3.1781 15.6107 120.0111 168.9300 46.0513 305.2858 351.8174 47.4909 12.6453 3.7738 17.1934 0.2133 12.6158 6.3085 17.4472 2.0485 3.0620 27.6814 0.8515 10.0071
temp: 298.150 k
press: 1.00000 atm
elementType: 9 9 9 8 7 7 7 7 6 6 6 6 6 6 6 6 6 6 6 6 6 6 1 1 1 1 1 1 1 1 1
symmnumber: 1
zpe: 551318.2 jmol-1
zpe.correction: 0.209986 hartree
zpe.thermalcorrener: 0.227813 hartree
zpe.thermalcorrenthalpy: 0.228758 hartree
zpe.thermalcorrgfe: 0.160497 hartree
zpe.sumelectzpe: -1131.042144 hartree
zpe.sumelectthermal: -1131.024316 hartree
zpe.sumelectthermalent: -1131.023372 hartree
zpe.sumelectthermalfe: -1131.091633 hartree
dipole: 0.5146 -1.4797 -0.6263
dipole: 1.6872
quadrupole: -107.1426 -138.1706 -130.0476
quadrupole: 25.4252 -1.5667 -0.5668
quadrupole: 17.9776 -13.0503 -4.9273 25.4252 -1.5667 -0.5668
hfenergy: -1131.2521297 hartree
pointgroup: C01 [X(C14H9F3N4O1)]
dipole: -0.1940486 -0.6338863 0.0341964 debye
polarizability: 262.1116397|-17.1647146|206.0652592|19.1810465|35.9228891|88.7099932 unknown
InChI: InChI=1S/C14H9F3N4O/c15-14(16,17)10-5-4-6-11(9-10)21-13(18-19-20-21)22-12-7-2-1-3-8-12/h1-9H
charge 0 multiplicity 1
31 atoms
F  -4.089581 -2.560922 -0.906909
F  -2.896277 -1.909963 -2.716671
F  -1.82277 -2.72996 -0.899263
O  1.35752 0.111486 0.093106
N  -0.162173 1.920323 0.371784
N  -0.084477 3.294272 0.748429
N  1.995341 2.385859 0.776779
N  1.209226 3.539741 0.982175
C  -1.433997 1.340534 0.059738
C  -2.802048 -0.509897 -0.72428
C  -1.527011 0.021144 -0.435694
C  -2.600227 2.123033 0.253823
C  -3.976109 0.252561 -0.53478
C  -3.861144 1.571049 -0.043831
C  1.126527 1.410292 0.404442
C  -2.900699 -1.898504 -1.29198
C  2.65562 -0.523814 0.127665
C  3.85941 0.134786 0.448616
C  2.59896 -1.893095 -0.202499
C  5.048618 -0.63196 0.431273
C  3.799008 -2.634308 -0.212655
C  5.027181 -2.005959 0.104026
H  -0.630977 -0.582801 -0.581093
H  -2.503772 3.142478 0.633822
H  -4.956464 -0.179163 -0.755376
H  -4.760998 2.173774 0.111136
H  3.865176 1.196811 0.702319
H  1.637545 -2.357693 -0.441389
H  5.99595 -0.140855 0.677535
H  3.771483 -3.698827 -0.466969
H  5.957159 -2.583622 0.095521
