program: Gaussian 09
title: 000115210
version: EM64L-G09RevD.01
frameworkgroup: C1[X(C18H20N2O3)]
method: RPBEPBE
basis: SDD
operation: Freq
keyword: #p
keyword: freq=noraman
keyword: PBEPBE/SDD
title: #p freq=noraman PBEPBE/SDD
converged: YES YES NO NO
title: Mulliken charges:
elementType: O O O N N C C C C C C C C C C C C C C C C C C H H H H H H H H H H H H H H H H H H H H
charge: -0.298502 -0.233715 -0.258654 -0.481382 0.039498 0.197646 0.012021 0.256268 0.224345 0.235220 0.296736 -0.429179 -0.178271 -0.530588 -0.435482 -0.775677 0.028714 -0.211902 0.161069 -0.695968 -0.691322 -0.215115 -0.673860 0.313285 0.239682 0.250685 0.234550 0.202193 0.245053 0.239753 0.231035 0.224642 0.229156 0.235156 0.208340 0.228626 0.244676 0.214612 0.221320 0.227334 0.204074 0.235435 0.228496
chargesum: 0.00000
title: Mulliken charges with hydrogens summed into heavy atoms:
elementType: O O O N N C C C C C C C C C C C C C C C C C C
charge: -0.298502 -0.233715 -0.258654 -0.168097 0.039498 0.197646 0.012021 0.256268 0.224345 0.235220 0.296736 -0.189497 -0.178271 -0.279903 -0.200933 -0.059836 0.230906 0.012740 0.161069 -0.023316 -0.003408 0.233539 -0.005855
polarizability: 3.42621247e+02 -1.08920112e+01 2.53519992e+02 4.67927251e+00 -4.41627763e+00 1.20939637e+02
1716.lowfreq: -1.5051 -0.0010 -0.0009 -0.0006 4.8440 5.7604 13.6768 32.7699 42.3246
frequency: 13.6537 32.7439 42.2922 52.2431 63.2501 81.7801 87.6614 97.1549 111.0321 118.2490 154.5355 181.3214 185.8841 209.3885 224.4354 239.2184 250.4748 255.4485 264.6088 300.8022 318.8890 329.9709 330.6264 357.8916 385.3026 417.1671 430.9510 465.2400 481.1296 514.6913 536.4768 550.7712 557.0347 566.9710 584.2264 611.1480 639.3531 644.3435 692.4433 718.6365 732.4600 743.4360 781.6907 782.4521 793.3621 798.0768 805.4413 822.8531 845.2900 853.3912 886.6577 901.9230 926.7092 941.8744 950.1883 979.3556 1016.0820 1037.5895 1042.9301 1050.6635 1070.8832 1084.7487 1105.5808 1112.6122 1133.3933 1150.6053 1152.6133 1176.1822 1183.0330 1207.4953 1233.2247 1246.4795 1248.7699 1274.6624 1302.2587 1317.1579 1332.6074 1348.7714 1350.0440 1356.5248 1382.2944 1396.7266 1399.1643 1401.2625 1408.1958 1418.9387 1422.9018 1439.1889 1456.3219 1460.2621 1461.4625 1467.9423 1468.5135 1471.8343 1472.5477 1486.5749 1488.7962 1495.1561 1541.9098 1575.1623 1590.5084 1598.1278 1621.5198 2982.3975 2988.7400 2994.5625 2994.7651 3003.6964 3013.9325 3061.7938 3084.7523 3090.9252 3093.8200 3095.3654 3099.2997 3103.3916 3107.3294 3115.2372 3136.1490 3139.9979 3157.9468 3178.6356 3611.8214
redmass: 3.8290 4.3482 3.2148 3.4894 3.4444 2.6496 2.7836 2.9287 1.5793 3.0706 3.8067 2.5320 1.1550 3.0831 1.7413 1.6429 2.1096 3.3301 3.8803 3.5919 5.3695 2.9469 5.7891 4.2771 3.2552 2.9173 4.4816 3.4006 5.4234 3.9532 1.1292 5.6009 3.8322 4.5520 6.9528 4.7865 6.2129 7.1156 6.2776 2.7613 5.1423 2.5154 4.8787 3.4117 5.3351 1.1462 5.0799 4.3434 1.4572 4.0643 1.4781 2.7065 1.2986 1.2941 1.3149 3.0133 2.3077 1.6193 5.5533 3.3059 3.6876 1.8393 1.8046 2.2289 1.4611 2.0577 3.1512 1.5011 2.1216 2.6364 1.5972 1.1423 2.3948 3.3927 2.0602 1.3981 4.8493 1.5511 2.8153 1.6324 1.2454 1.3323 1.2727 1.5480 4.2165 2.0509 2.1794 4.4121 1.0552 1.1203 1.0401 1.2344 1.0599 1.0991 1.0666 1.0714 1.0914 2.3119 8.1835 7.0519 5.8999 9.7351 7.8448 1.0842 1.0360 1.0363 1.0365 1.0576 1.0410 1.1066 1.0993 1.0985 1.0998 1.1000 1.0917 1.1005 1.1020 1.0919 1.0865 1.1003 1.0950 1.0948 1.0803
irintensity: 1.6502 0.0305 1.1696 1.0489 0.9673 1.0911 2.1154 0.5593 0.7338 1.3797 2.3628 1.5644 0.0537 2.7443 1.0092 1.1596 0.9161 3.4960 2.3663 2.1699 6.8008 1.8902 1.7354 9.8667 5.4251 0.3954 1.2794 1.6891 2.6718 0.6879 90.3656 3.5462 0.9888 3.8509 3.1447 0.2626 8.5562 8.7308 4.6134 49.4376 10.1811 16.9044 15.8856 41.9771 13.4895 2.3724 6.9442 9.2801 0.5655 6.1625 22.0010 17.5748 2.2103 0.2435 1.0186 6.8331 3.6247 27.7194 245.7330 80.4859 105.4064 55.7137 159.5445 2.9136 4.2325 12.3612 122.5656 16.8215 37.4093 148.6577 47.5774 1.0209 164.3536 120.1567 11.5809 9.6697 155.3253 1.0432 11.3847 36.4014 32.9379 66.1948 15.9098 4.4922 3.7873 18.0450 0.6990 17.6762 6.5850 17.3789 12.2721 40.3661 11.2010 30.5908 10.1837 10.8501 3.0948 79.2989 11.5211 46.5461 130.2342 122.7003 80.8349 27.3050 17.0539 27.3487 18.0168 27.5302 9.6118 11.7343 10.5051 35.7754 42.2608 30.7353 12.4772 31.4805 41.7171 23.6917 4.5534 7.9558 22.0373 18.6210 67.7231
temp: 298.150 k
press: 1.00000 atm
elementType: 8 8 8 7 7 6 6 6 6 6 6 6 6 6 6 6 6 6 6 6 6 6 6 1 1 1 1 1 1 1 1 1 1 1 1 1 1 1 1 1 1 1 1
symmnumber: 1
zpe: 904133.9 jmol-1
zpe.correction: 0.344366 hartree
zpe.thermalcorrener: 0.366758 hartree
zpe.thermalcorrenthalpy: 0.367702 hartree
zpe.thermalcorrgfe: 0.291215 hartree
zpe.sumelectzpe: -1031.437216 hartree
zpe.sumelectthermal: -1031.414825 hartree
zpe.sumelectthermalent: -1031.413880 hartree
zpe.sumelectthermalfe: -1031.490367 hartree
dipole: 4.7709 -0.9401 1.2601
dipole: 5.0232
quadrupole: -115.1463 -112.7864 -140.7247
quadrupole: 0.7710 -3.5669 3.5706
quadrupole: 7.7395 10.0994 -17.8389 0.7710 -3.5669 3.5706
hfenergy: -1031.7815822 hartree
pointgroup: C01 [X(C18H20N2O3)]
dipole: -1.9091293 0.0096074 0.5107408 debye
polarizability: 343.7308432|4.3048858|249.7579139|-6.0776301|18.6052666|123.5921191 unknown
InChI: InChI=1S/C18H20N2O3/c1-5-22-18(21)17-11(4)15-13(9-19-17)20-12-7-6-8-14(16(12)15)23-10(2)3/h6-10,20H,5H2,1-4H3
charge 0 multiplicity 1
43 atoms
O  -2.024345 -1.961408 -0.159561
O  4.562177 0.221376 0.492579
O  3.647959 -1.300434 -1.007218
N  -1.215774 2.651446 0.434471
N  2.39436 1.808923 0.106364
C  -0.197913 0.592992 0.153038
C  -1.660144 0.397795 0.215635
C  -2.244475 1.703417 0.39932
C  0.012765 2.013633 0.283003
C  0.96467 -0.234187 0.02154
C  -2.570269 -0.702588 0.100146
C  -3.629844 1.948241 0.510936
C  2.225125 0.445878 -0.011647
C  1.301303 2.584765 0.256459
C  -3.963795 -0.472027 0.220007
C  0.885121 -1.74541 -0.019655
C  -2.912216 -3.155989 -0.29191
C  -4.47952 0.833003 0.423938
C  3.50614 -0.308807 -0.243054
C  -2.085477 -4.176671 -1.08125
C  -3.324594 -3.664346 1.100766
C  5.896926 -0.403232 0.246927
C  6.893421 0.349272 1.123025
H  -1.347759 3.653384 0.550857
H  -4.023387 2.958963 0.655107
H  1.463289 3.664921 0.352318
H  -4.669154 -1.302786 0.147792
H  -3.80297 -2.865008 -0.885379
H  0.540185 -2.09239 -1.009548
H  1.862881 -2.209797 0.166952
H  0.14904 -2.107159 0.713342
H  -5.56361 0.966044 0.507966
H  -1.164695 -4.437511 -0.530969
H  -1.798881 -3.769814 -2.065751
H  -2.672841 -5.099301 -1.238391
H  -2.429789 -3.973133 1.66936
H  -3.852845 -2.890012 1.682646
H  -3.992421 -4.539878 1.002948
H  5.834925 -1.478158 0.498588
H  6.128904 -0.318046 -0.830523
H  7.908244 -0.066182 0.981896
H  6.912596 1.420369 0.859748
H  6.624386 0.260353 2.189479
