program: Gaussian 09
title: 000115200
version: EM64L-G09RevD.01
frameworkgroup: C1[X(C12H12N4)]
method: RPBEPBE
basis: SDD
operation: Freq
keyword: #pfreq=noraman
keyword: PBEPBE/SDD
title: #p freq=noraman PBEPBE/SDD
converged: NO YES NO NO
title: Mulliken charges:
elementType: N N N N C C C C C C C C C C C C H H H H H H H H H H H H
charge: -0.235401 -0.079558 0.003563 -0.630746 0.353544 -0.192847 0.403958 -0.300028 0.521386 -0.610457 0.114629 -0.344710 -0.664281 -0.816943 -0.189809 -0.384312 0.230089 0.274686 0.240363 0.253631 0.240551 0.201764 0.242861 0.243000 0.223812 0.232718 0.340060 0.328477
chargesum: 0.00000
title: Mulliken charges with hydrogens summed into heavy atoms:
elementType: N N N N C C C C C C C C C C C C
charge: -0.235401 -0.079558 0.003563 0.037790 0.353544 -0.192847 0.403958 -0.300028 0.521386 -0.380368 0.114629 -0.070024 0.070264 -0.129317 0.034003 -0.151594
polarizability: 2.53856739e+02 5.09653287e+00 1.77150193e+02 3.25013002e-02 -7.02647654e-03 7.07871499e+01
1716.lowfreq: -74.8286 -4.0375 -0.0006 -0.0004 0.0008 7.6400 9.6657 76.8004 97.1078
frequency: -74.8146 76.7987 97.1074 115.4628 129.4937 142.5934 180.9884 198.3278 237.6890 251.5418 275.3909 314.8537 351.4086 374.1749 412.1420 426.6714 435.8120 483.5660 521.3724 525.3824 611.0844 612.4932 628.9325 649.9669 685.9553 733.6148 750.3925 799.0210 801.7806 846.9778 853.9713 861.9771 937.2127 971.9557 990.3958 990.7247 1017.0971 1031.7566 1050.1686 1063.1073 1094.9513 1119.3954 1145.1991 1180.1094 1216.4702 1245.0065 1259.4013 1313.5216 1344.2339 1382.5986 1393.0805 1402.0406 1409.0878 1418.4400 1449.9216 1453.8688 1463.7909 1473.0988 1476.6573 1484.2443 1508.3951 1554.0567 1570.7974 1596.4885 1614.4401 1643.8629 2969.2459 2983.5726 3043.6786 3068.4479 3082.5402 3109.1245 3113.0034 3121.2088 3143.7601 3165.7860 3580.5896 3726.8404
redmass: 1.1210 2.4359 4.0469 1.6133 1.0725 2.9976 4.1443 3.1931 3.3838 2.8799 2.8273 4.6384 4.4267 4.1063 6.1148 2.8737 1.3335 4.9453 4.3184 5.4672 3.0221 3.8133 4.8575 6.4026 9.6045 6.3138 6.0639 6.3172 1.4298 2.7340 4.1839 1.7358 1.4322 3.2211 1.8135 1.3676 2.5161 2.5006 1.5592 2.7408 2.3959 1.3082 1.3721 2.0927 1.9987 2.3339 5.0231 4.5584 3.8175 2.1158 2.3495 1.3764 2.3229 3.6490 1.0464 2.4101 1.7912 1.7167 1.0407 1.1382 3.4219 2.7447 3.6835 7.0437 2.7156 3.2312 1.0368 1.0359 1.1023 1.0966 1.1008 1.0963 1.0890 1.0910 1.0896 1.0997 1.0449 1.1048
irintensity: 37.3500 0.3481 0.1239 36.3456 5.9833 42.7785 4.8134 25.4815 14.5038 0.7651 4.5194 5.7982 0.4132 37.0987 0.3481 11.4385 128.0665 2.9191 0.2858 0.6668 0.8338 5.6539 15.6391 4.1239 8.1127 1.2867 1.6590 3.3036 54.8204 0.1232 1.2894 28.2167 0.0068 21.2178 17.8531 1.2830 1.1363 3.3819 7.7976 1.1631 9.7165 0.4270 3.1269 29.9547 9.3028 9.2214 17.3028 8.1548 47.7751 32.1200 54.4755 22.4094 14.2913 9.0478 11.1843 41.7352 49.3938 33.5287 13.9907 21.8508 7.0696 114.3562 39.9836 27.0840 140.1324 445.5358 78.7615 42.3756 28.0539 15.2015 21.2820 7.9619 26.4796 21.5761 14.0855 25.4229 133.2769 41.2775
temp: 298.150 k
press: 1.00000 atm
elementType: 7 7 7 7 6 6 6 6 6 6 6 6 6 6 6 6 1 1 1 1 1 1 1 1 1 1 1 1
symmnumber: 1
zpe: 578755.2 jmol-1
zpe.correction: 0.220436 hartree
zpe.thermalcorrener: 0.233812 hartree
zpe.thermalcorrenthalpy: 0.234756 hartree
zpe.thermalcorrgfe: 0.181049 hartree
zpe.sumelectzpe: -682.385797 hartree
zpe.sumelectthermal: -682.372421 hartree
zpe.sumelectthermalent: -682.371477 hartree
zpe.sumelectthermalfe: -682.425185 hartree
dipole: 6.4483 0.9894 0.0006
dipole: 6.5238
quadrupole: -67.0352 -85.1755 -98.3510
quadrupole: 7.3999 0.0001 0.0030
quadrupole: 16.4854 -1.6550 -14.8304 7.3999 0.0001 0.0030
hfenergy: -682.6062337 hartree
pointgroup: C01 [X(C12H12N4)]
dipole: -2.5435653 0.3434341 -0.0002264 debye
polarizability: 254.0156435|-3.7094998|176.9912885|0.0323692|0.0076117|70.7871499 unknown
InChI: InChI=1S/C12H12N4/c1-7-6-9-11(15-12(13)16(9)2)8-4-3-5-14-10(7)8/h3-6H,13H2,1-2H3
charge 0 multiplicity 1
28 atoms
N  -2.556452 0.473617 -0.000253
N  -1.578365 -1.609202 -0.00031
N  3.030494 0.412216 0.000264
N  -3.993883 -1.494817 -0.000728
C  -1.157447 0.687728 -0.000223
C  -0.581823 -0.610793 -0.000268
C  0.838848 -0.75059 -0.000122
C  1.641792 0.464113 0.000078
C  1.018118 1.7753 0.000154
C  -0.381168 1.874668 -0.000011
C  -2.738151 -0.921202 -0.000417
C  1.511821 -2.009371 -0.000109
C  -3.612071 1.484213 -0.001824
C  1.893025 3.011413 0.000509
C  2.909836 -2.037346 0.000065
C  3.624616 -0.798887 0.000223
H  -0.849266 2.866523 0.000002
H  0.914115 -2.926531 -0.000248
H  -4.249989 1.403394 0.899199
H  -3.154834 2.485574 -0.000713
H  -4.246981 1.403826 -0.905009
H  1.281645 3.93135 -0.001461
H  2.558114 3.025046 0.882488
H  2.561364 3.023184 -0.878976
H  3.460109 -2.983906 0.00006
H  4.721983 -0.796248 0.000341
H  -4.044032 -2.508984 -0.000731
H  -4.847518 -0.947088 0.000121
