program: Gaussian 09
title: 000115190
version: EM64L-G09RevD.01
frameworkgroup: C1[X(CHCl3O2)]
method: RPBEPBE
basis: SDD
operation: Freq
keyword: #p
keyword: freq=noraman
keyword: PBEPBE/SDD
title: #p freq=noraman PBEPBE/SDD
converged: NO NO NO NO
title: Mulliken charges:
elementType: Cl Cl Cl O O C H
charge: 0.085254 0.137116 0.139878 -0.064812 -0.297336 -0.382216 0.382114
chargesum: 0.00000
title: Mulliken charges with hydrogens summed into heavy atoms:
elementType: Cl Cl Cl O O C
charge: 0.085254 0.137116 0.139878 -0.064812 0.084779 -0.382216
polarizability: 6.08565582e+01 -9.63260439e-01 5.13317059e+01 -3.09574556e+00 -8.42090662e-01 3.87965271e+01
1716.lowfreq: -14.0364 -9.2819 -0.0024 0.0026 0.0032 6.7273 125.0617 176.0979 193.6109
frequency: 125.0514 176.0805 193.5657 227.2194 242.7804 303.2714 368.4172 391.5798 494.7034 693.0081 762.6816 814.9124 938.2774 1281.0552 3424.8062
redmass: 8.8070 3.6623 1.4750 15.6912 18.5656 22.0201 16.3025 18.4822 17.0408 11.5230 12.1192 15.0390 10.5700 1.1209 1.0681
irintensity: 6.3256 20.3004 120.2077 7.0405 0.3509 1.1247 2.6731 4.1219 40.7549 305.5737 187.3485 23.7901 162.2255 56.1035 33.0316
temp: 298.150 k
press: 1.00000 atm
elementType: 17 17 17 8 8 6 1
symmnumber: 1
zpe: 62429.6 jmol-1
zpe.correction: 0.023778 hartree
zpe.thermalcorrener: 0.031126 hartree
zpe.thermalcorrenthalpy: 0.032070 hartree
zpe.thermalcorrgfe: -0.008835 hartree
zpe.sumelectzpe: -1568.737475 hartree
zpe.sumelectthermal: -1568.730127 hartree
zpe.sumelectthermalent: -1568.729183 hartree
zpe.sumelectthermalfe: -1568.770089 hartree
dipole: 0.8938 -1.5272 0.4555
dipole: 1.8272
quadrupole: -50.6295 -53.9858 -55.5553
quadrupole: -4.3440 1.8736 -2.8802
quadrupole: 2.7607 -0.5956 -2.1651 -4.3440 1.8736 -2.8802
hfenergy: -1568.7612534 hartree
pointgroup: C01 [X(C1H1Cl3O2)]
dipole: 0.3582201 -0.6206024 0.0577784 debye
dipolederiv: -0.1609275 0.0378185 0.0426357 -0.0514525 -0.6946276 -0.3572003 -0.0821119 -0.3405199 -0.4369289 -0.5752086 -0.0074769 0.3274743 0.0048008 -0.1342142 0.011573 0.2357853 0.0142231 -0.3501322 -0.1127733 -0.012296 0.0370403 0.0192947 -0.677271 0.3061349 -0.037104 0.3257048 -0.3477753 -0.1610845 -0.0007467 -0.245561 -0.0638097 -0.4261263 0.0631326 -0.3904128 0.0078095 -0.5192738 -0.5589865 -0.0157888 -0.0495474 0.1425551 0.0780607 -0.1163847 0.0067254 -0.0701687 -0.2888131 1.2500993 -0.0055257 -0.1688489 0.0038949 1.7708659 0.0300378 0.1756848 0.0141372 1.5950457 0.3188812 0.0040155 0.056807 -0.0552832 0.0833126 0.0627068 0.0914332 0.0488141 0.3478775 unknown
polarizability: 56.2514637|-1.5696235|51.4756705|-9.3793959|-0.0556566|43.2576571 unknown
InChI: InChI=1S/CHCl3O2/c2-1(3,4)6-5/h5H
charge 0 multiplicity 1
7 atoms
Cl -0.324321 -1.492661 -1.173367
Cl -1.888425 -0.024546 1.008193
Cl -0.298248 1.539358 -1.064741
O  0.670308 -0.057499 0.947478
O  2.017535 0.012915 0.229321
C  -0.359141 0.003462 -0.02919
H  2.322592 -0.937129 0.353005
