program: Gaussian 09
title: 000115160
version: EM64L-G09RevD.01
frameworkgroup: C1[X(C10H16N2O6)]
method: RPBEPBE
basis: SDD
operation: Freq
keyword: #p
keyword: freq=noraman
keyword: PBEPBE/SDD
title: #p freq=noraman PBEPBE/SDD
converged: YES YES NO NO
title: Mulliken charges:
elementType: O O O O O O N N C C C C C C C C C C H H H H H H H H H H H H H H H H
charge: -0.304695 -0.445117 -0.456600 -0.437120 -0.254094 -0.232591 -0.154389 -0.390508 -0.001776 -0.506157 -0.122441 -0.099864 -0.431974 0.161744 -0.327021 0.236856 0.091180 -0.694203 0.294914 0.240880 0.279791 0.225552 0.250677 0.272840 0.249252 0.184008 0.219202 0.235494 0.242956 0.238557 0.360132 0.342719 0.369789 0.362006
chargesum: 0.00000
title: Mulliken charges with hydrogens summed into heavy atoms:
elementType: O O O O O O N N C C C C C C C C C C
charge: -0.304695 -0.102398 -0.086811 -0.075114 -0.254094 -0.232591 -0.154389 -0.030375 0.293137 0.014515 0.103111 0.150813 0.090118 0.161744 0.076190 0.236856 0.091180 0.022804
polarizability: 1.71600842e+02 2.77147196e+00 1.39887987e+02 7.88590958e-01 7.33111755e+00 1.04140651e+02
1716.lowfreq: -11.2886 -6.4127 -0.0002 0.0005 0.0007 5.7050 25.9993 35.7408 48.3282
frequency: 25.7284 35.7259 48.3015 77.9742 84.8340 119.7459 155.9030 159.7575 176.2014 188.4767 215.7977 237.0426 254.7375 279.0574 294.6056 320.4774 328.9614 342.0813 358.0632 399.9618 412.7843 417.4262 452.7389 471.2033 482.3631 512.4669 526.4278 591.4808 629.5763 671.5418 685.9053 702.6598 722.2045 734.0690 774.7245 801.3296 826.8897 860.7985 879.9623 899.9197 933.1743 949.1605 964.5788 971.4506 990.2099 1010.2379 1033.8095 1058.7749 1077.4919 1100.6322 1113.8324 1132.5898 1151.0779 1156.7007 1173.0276 1189.1387 1212.3348 1233.2344 1244.8888 1272.2735 1275.5038 1293.0139 1304.0784 1312.2431 1328.2089 1333.7336 1358.5125 1361.8169 1370.3352 1375.2216 1384.3354 1391.5443 1415.6773 1450.1382 1465.7316 1467.3907 1467.8957 1477.1610 1629.7840 1654.0299 2935.1893 2981.6849 2991.2018 2997.9313 3011.9436 3037.8506 3063.9586 3074.0193 3086.2096 3095.9043 3098.9065 3115.5834 3468.1597 3517.0770 3517.5620 3564.9250
redmass: 6.5729 5.8283 6.4045 4.4465 5.8840 3.0686 7.2706 5.0652 5.2272 3.4832 1.5253 1.8527 4.5120 1.1514 3.4985 3.8561 2.7889 4.4767 5.1255 4.0014 1.4540 3.4906 2.7884 1.3644 3.1991 3.6068 2.9523 4.7892 3.7086 2.0789 4.6890 6.9526 5.8745 5.6683 2.0524 4.0367 3.3912 2.9937 2.5066 3.4903 2.2152 2.1942 2.6883 2.1536 2.4002 2.8917 2.1187 3.0944 2.5487 1.9120 2.2019 2.8635 1.9077 1.2767 1.2185 1.4916 2.4587 1.9727 1.8146 1.2667 1.6012 1.3375 1.4289 1.3648 2.0555 1.4338 1.8058 1.4703 1.6119 1.6316 1.2909 1.3207 1.9067 1.1207 1.0734 1.0980 1.0942 1.0769 9.9251 5.9903 1.0692 1.0855 1.0345 1.0638 1.0857 1.0635 1.0940 1.0866 1.0997 1.1002 1.1009 1.1023 1.0650 1.0654 1.0767 1.0663
irintensity: 0.5524 0.8339 0.3502 1.5888 3.6041 3.4101 3.0604 0.8927 2.4675 11.9174 0.7035 0.6042 1.0955 172.9012 30.1387 13.5197 15.2812 12.6782 9.8363 17.7945 63.0447 34.2651 32.1482 82.0268 28.2913 35.1094 11.7626 8.9074 6.8763 19.1620 15.4384 7.5972 2.5438 9.0849 109.1839 20.2952 47.3358 45.9152 25.0334 82.3018 18.6172 34.4612 27.8423 48.6358 55.7940 100.9611 25.4895 26.2741 32.1661 81.3941 68.8193 14.0043 74.0112 26.1641 25.6744 6.2762 176.1537 55.7603 40.8387 3.9437 101.3128 14.6776 44.9340 48.5196 93.1516 9.3222 11.6617 12.3776 36.4114 5.5807 6.6393 44.3994 146.7637 19.7078 14.4456 24.2040 14.1747 11.8343 235.4890 464.4681 56.1832 48.0076 9.9789 18.7855 36.3546 16.7188 48.7975 2.2734 6.2208 13.1145 18.3282 7.3466 30.7458 17.1457 52.7957 6.7974
temp: 298.150 k
press: 1.00000 atm
elementType: 8 8 8 8 8 8 7 7 6 6 6 6 6 6 6 6 6 6 1 1 1 1 1 1 1 1 1 1 1 1 1 1 1 1
symmnumber: 1
zpe: 704618.3 jmol-1
zpe.correction: 0.268375 hartree
zpe.thermalcorrener: 0.286413 hartree
zpe.thermalcorrenthalpy: 0.287357 hartree
zpe.thermalcorrgfe: 0.221883 hartree
zpe.sumelectzpe: -950.110145 hartree
zpe.sumelectthermal: -950.092107 hartree
zpe.sumelectthermalent: -950.091163 hartree
zpe.sumelectthermalfe: -950.156638 hartree
dipole: -3.1782 0.1918 1.9014
dipole: 3.7085
quadrupole: -99.8845 -127.0716 -107.0935
quadrupole: -0.1638 -5.9111 -2.6485
quadrupole: 11.4654 -15.7217 4.2564 -0.1638 -5.9111 -2.6485
hfenergy: -950.3785203 hartree
pointgroup: C01 [X(C10H16N2O6)]
dipole: 1.2337706 -0.1058054 0.7716171 debye
polarizability: 171.646434|2.6691129|140.2152782|0.6492092|-6.2930913|103.7677675 unknown
InChI: InChI=1S/C10H16N2O6/c1-10(17)4-12(9(16)11-8(10)15)7-2-5(14)6(3-13)18-7/h5-7,11,13-14,17H,2-4H2,1H3
charge 0 multiplicity 1
34 atoms
O  1.557342 -0.159738 -0.893791
O  3.934039 1.655674 0.244206
O  -2.744626 -1.937768 1.052796
O  2.297582 -2.850374 -1.0180
O  -0.899059 2.840541 -0.961261
O  -4.436062 -0.055157 -0.056768
N  -0.401369 0.797271 0.107122
N  -2.645473 1.405627 -0.390231
C  1.035151 0.972417 -0.058271
C  1.877485 0.926853 1.235724
C  3.253137 0.45098 0.742636
C  2.909608 -0.545206 -0.395501
C  -0.928308 -0.376617 0.839467
C  -2.163644 -0.968195 0.128654
C  2.830254 -2.013648 0.055268
C  -1.256406 1.745933 -0.448704
C  -3.192561 0.158919 -0.105245
C  -1.811604 -1.640695 -1.21895
H  1.1899 1.915607 -0.606761
H  1.457928 0.212138 1.964575
H  1.954379 1.918804 1.706231
H  3.852998 -0.031815 1.541265
H  3.607077 -0.4528 -1.250286
H  -1.214295 -0.110773 1.875243
H  -0.142282 -1.148068 0.876246
H  2.204749 -2.097415 0.972348
H  3.835647 -2.413171 0.275634
H  -1.206222 -0.978819 -1.863103
H  -1.233969 -2.557062 -1.004694
H  -2.729871 -1.928417 -1.759273
H  -3.281766 2.164606 -0.656003
H  4.776088 1.402826 -0.212165
H  -3.731504 -1.92783 0.908301
H  1.507658 -2.375927 -1.391309
