program: Gaussian 09
title: 000115147
version: EM64L-G09RevD.01
frameworkgroup: C1[X(C9H21N2O2)]
method: RPBEPBE
basis: SDD
operation: Freq
keyword: #p
keyword: freq=noraman
keyword: PBEPBE/SDD
title: #p freq=noraman PBEPBE/SDD
converged: YES YES NO NO
title: Mulliken charges:
elementType: O O N N C C C C C C C C C H H H H H H H H H H H H H H H H H H H H H
charge: -0.413850 -0.224974 -0.110863 -0.652038 -0.352979 -0.411168 -0.355568 -0.555093 -0.555376 -0.543832 -0.377893 -0.189771 0.144878 0.267496 0.271872 0.226580 0.229402 0.210940 0.244711 0.270965 0.274547 0.261229 0.261342 0.275491 0.269732 0.269127 0.270099 0.264293 0.234752 0.209881 0.278003 0.323416 0.291162 0.393488
chargesum: 1.00000
title: Mulliken charges with hydrogens summed into heavy atoms:
elementType: O O N N C C C C C C C C C
charge: -0.020362 -0.224974 -0.110863 -0.037460 0.186389 0.044813 0.100082 0.251647 0.251189 0.259687 0.066740 0.088232 0.144878
polarizability: 1.30319047e+02 -6.29476346e-01 1.07861652e+02 2.67457561e+00 8.54590417e-01 1.05980961e+02
1716.lowfreq: -17.0809 -2.4311 -0.0008 -0.0004 0.0004 4.4673 9.3929 34.1218 42.4355
frequency: -2.3156 34.0827 42.3470 58.2845 80.7676 93.9721 121.4178 165.5722 195.2119 226.8010 244.8344 247.9140 261.6137 278.7086 300.5059 338.6732 342.0409 379.4472 432.0753 444.3132 460.8008 492.6361 526.4342 564.4733 630.8141 676.2503 715.7853 727.4579 746.9173 778.0276 807.0514 860.3002 896.2505 932.2536 940.3931 954.9338 1027.5132 1044.7736 1047.0945 1053.3405 1060.9868 1077.7791 1095.1081 1115.5342 1144.1814 1166.9888 1193.5948 1207.6122 1229.4330 1234.8609 1247.5305 1266.6598 1284.6042 1286.5057 1301.7536 1319.6381 1329.2741 1360.2979 1367.0998 1383.6071 1422.4679 1424.7671 1444.9356 1453.0587 1456.2159 1458.6941 1465.2740 1469.2201 1472.3888 1483.3823 1486.3423 1487.5130 1500.0949 1618.9022 1669.3476 2943.1425 2965.8919 2990.6619 2996.5425 3013.9839 3021.3876 3024.4200 3027.7201 3031.4852 3051.7647 3066.2780 3090.9602 3139.4926 3140.5561 3145.3436 3146.2126 3154.6207 3158.6570 3472.2742 3515.7295 3611.7849
redmass: 3.0121 4.7482 5.6172 2.6585 2.1340 2.7222 2.3982 2.4423 1.3722 1.2043 1.1073 2.4786 1.0641 3.0403 3.4326 3.1718 2.2341 2.7851 2.2702 3.3827 2.9317 2.8820 2.5905 4.1751 1.2426 1.4160 4.1942 4.2019 1.1063 1.3981 2.7659 3.3579 1.8416 2.6735 2.6962 1.9118 3.0198 1.2277 2.5457 2.2478 2.0309 1.5847 1.5796 1.6424 1.4366 1.2310 1.9237 1.4695 1.7077 1.5788 1.8696 1.5764 1.2774 1.4264 1.1083 1.2363 1.3064 1.4317 1.3330 1.7532 1.1448 1.1436 1.0928 1.0475 1.0975 1.1016 1.0398 1.0604 1.0931 1.0789 1.0550 1.0727 1.0600 1.4728 2.9134 1.0817 1.0590 1.0593 1.0605 1.0580 1.0994 1.0324 1.0332 1.0339 1.1035 1.1041 1.1079 1.1054 1.1058 1.1050 1.1052 1.1049 1.1044 1.0476 1.0643 1.0971
irintensity: 0.0809 0.8323 2.3098 0.9384 0.9377 0.3144 0.5223 4.6699 0.6404 21.7073 1.0951 5.9305 0.0675 1.8190 0.5321 2.4707 0.2548 1.3255 0.1277 10.8365 15.7702 3.7277 37.7661 25.8068 49.9595 318.1440 6.0929 1.1039 22.2904 3.2947 3.8294 49.3301 12.4470 9.8431 16.7702 4.7915 13.1296 0.3072 30.6133 204.4784 3.5548 14.6998 8.9549 6.4326 2.8790 4.1417 10.0219 20.2521 11.3649 0.5669 0.1109 6.0713 4.4459 12.1498 8.0491 0.1450 3.7688 1.6346 4.0356 5.1994 16.5187 19.0523 1.3836 0.4343 4.2755 10.4965 0.4104 2.0933 3.7872 7.5899 38.4756 58.1684 86.9301 199.9456 99.5862 29.3530 12.3139 6.2860 46.4594 12.9333 5.3150 4.7017 2.7968 2.8735 3.2626 33.9464 20.6124 0.7683 0.2016 3.7052 11.5682 1.1002 6.1934 16.1485 40.2932 21.6812
temp: 298.150 k
press: 1.00000 atm
elementType: 8 8 7 7 6 6 6 6 6 6 6 6 6 1 1 1 1 1 1 1 1 1 1 1 1 1 1 1 1 1 1 1 1 1
symmnumber: 1
zpe: 794719.0 jmol-1
zpe.correction: 0.302692 hartree
zpe.thermalcorrener: 0.318300 hartree
zpe.thermalcorrenthalpy: 0.319244 hartree
zpe.thermalcorrgfe: 0.259320 hartree
zpe.sumelectzpe: -614.174640 hartree
zpe.sumelectthermal: -614.159033 hartree
zpe.sumelectthermalent: -614.158089 hartree
zpe.sumelectthermalfe: -614.218012 hartree
dipole: -12.9544 -0.2664 -1.0839
dipole: 13.0024
quadrupole: -12.4608 -64.7188 -76.9887
quadrupole: 2.6395 -8.3374 -1.1776
quadrupole: 38.9287 -13.3294 -25.5993 2.6395 -8.3374 -1.1776
hfenergy: -614.4773326 hartree
pointgroup: C01 [X(C9H21N2O2)]
dipole: -5.0830726 -0.2016908 -0.5388868 debye
polarizability: 130.2057559|-0.222681|107.844486|3.1923381|0.9021171|106.1114177 unknown
InChI: InChI=1S/C9H21N2O2/c1-11(2,3)7-5-4-6-8(10)9(12)13/h8,12H,4-7,10H2,1-3H3
charge 1 multiplicity 1
34 atoms
O  3.452839 -1.56485 -0.5267
O  3.724028 -0.511203 1.526377
N  -3.538247 -0.138831 0.077405
N  2.798352 1.897878 0.543531
C  -2.035168 -0.12701 0.489668
C  -1.024554 0.175548 -0.626154
C  0.405704 0.166249 -0.025906
C  -3.960606 1.228247 -0.455378
C  -3.797371 -1.204282 -0.984515
C  -4.366668 -0.46414 1.321009
C  1.485905 0.494234 -1.075449
C  2.871139 0.782774 -0.407277
C  3.390992 -0.459239 0.322755
H  -1.840594 -1.123353 0.926471
H  -1.953489 0.625069 1.294925
H  -1.206882 1.171116 -1.073338
H  -1.082413 -0.576756 -1.435517
H  0.611687 -0.825723 0.425552
H  0.491397 0.92416 0.778494
H  -3.727629 1.994804 0.299396
H  -3.41751 1.444421 -1.385708
H  -5.043522 1.214842 -0.653632
H  -4.877512 -1.244287 -1.193673
H  -3.251954 -0.946668 -1.902698
H  -3.453043 -2.179051 -0.606589
H  -4.066928 -1.451092 1.704851
H  -4.182637 0.304185 2.0872
H  -5.434368 -0.476228 1.053125
H  1.599385 -0.326334 -1.807806
H  1.201413 1.409517 -1.630315
H  3.591662 0.968192 -1.234411
H  3.221119 1.693136 1.455147
H  3.064325 2.807922 0.164063
H  3.846746 -2.341348 -0.043705
