program: Gaussian 09
title: 000115102
version: EM64L-G09RevD.01
frameworkgroup: C1[X(C16H13ClO2)]
method: RPBEPBE
basis: SDD
operation: Freq
keyword: #p
keyword: freq=noraman
keyword: PBEPBE/SDD
title: #p freq=noraman PBEPBE/SDD
converged: YES YES NO NO
title: Mulliken charges:
elementType: Cl O O C C C C C C C C C C C C C C C C H H H H H H H H H H H H H
charge: -0.037306 -0.196529 -0.168270 -0.453817 0.340462 0.285468 0.023472 0.165200 0.153643 -0.445061 -0.409486 -0.728857 -0.392264 -0.400002 -0.243474 -0.251829 -0.232438 -0.232080 0.103213 0.258433 0.255861 0.241733 0.240783 0.256292 0.252311 0.219257 0.241146 0.241310 0.228712 0.227261 0.228477 0.228376
chargesum: 0.00000
title: Mulliken charges with hydrogens summed into heavy atoms:
elementType: Cl O O C C C C C C C C C C C C C C C C
charge: -0.037306 -0.196529 -0.168270 -0.195384 0.340462 0.285468 0.279333 0.165200 0.153643 -0.203328 -0.168703 -0.000997 -0.151118 -0.158692 -0.014762 -0.024568 -0.003961 -0.003704 0.103213
polarizability: 1.74515373e+02 -3.39989993e+01 2.19428277e+02 3.60948735e+01 9.47249904e+00 1.60727841e+02
1716.lowfreq: -0.0014 -0.0014 0.0013 1.2928 6.8709 9.2064 19.9899 28.1802 36.5279
frequency: 19.9273 28.1438 36.5189 78.2206 106.1101 116.8044 150.4711 167.2558 202.4623 208.1736 248.6307 275.7853 292.8369 357.8267 406.7032 412.3223 423.0823 432.3761 444.5935 465.0919 510.2049 545.8942 568.4206 610.7240 616.2097 622.3076 661.8208 715.6174 743.5200 745.6081 750.4744 758.7356 786.8155 792.5554 838.6302 849.7218 881.0454 883.7523 937.7689 947.8937 950.7841 985.6182 987.6969 996.9747 1006.6018 1024.0596 1031.1422 1066.0373 1087.6183 1100.3520 1116.7754 1137.1916 1163.0587 1172.0711 1174.8942 1185.5543 1200.1147 1242.4288 1257.2711 1294.1643 1305.0702 1321.8905 1333.5976 1379.6338 1389.6240 1404.3085 1439.6715 1445.3979 1465.4667 1470.0214 1483.6289 1486.3393 1591.7690 1595.7390 1618.9606 1621.4821 1685.1716 2968.0416 2998.1272 3023.3751 3092.0164 3113.6085 3117.9896 3125.5312 3129.1642 3134.9024 3143.7882 3147.1628 3163.1682 3163.9484
redmass: 7.8289 9.9892 8.9461 4.5643 4.9480 3.7769 4.6738 4.2748 4.6425 3.8953 1.2854 3.5276 4.3184 5.3300 4.4270 6.3636 5.8710 4.0149 3.0473 4.0472 5.0257 4.4888 3.3478 6.0814 9.1065 5.5573 4.9552 4.6488 1.7163 3.1696 3.3936 1.7997 5.4294 2.2837 2.9294 2.4355 1.6226 1.6057 2.1668 1.4354 1.5465 1.3348 1.3237 6.7970 1.8922 2.2103 2.0554 4.3624 2.4025 2.0464 1.6960 1.9396 1.2991 1.1255 1.1233 1.6513 2.1407 1.8024 2.3233 1.4811 1.9478 1.2677 1.4366 7.3173 1.2313 3.8908 2.2333 2.7107 1.1099 2.3042 1.4586 1.9515 6.5456 7.0003 7.4036 7.0796 12.0872 1.0813 1.0367 1.0859 1.0987 1.1000 1.0880 1.0852 1.0879 1.0894 1.0938 1.0948 1.1002 1.1002
irintensity: 0.8243 0.4212 0.1397 0.1524 2.2375 0.1398 2.2333 0.3552 0.0603 2.2051 0.4140 4.6405 0.6897 17.5750 3.6463 1.1248 2.0996 16.9367 0.3558 0.6153 1.1210 27.5946 0.9907 8.0525 12.7423 4.9603 16.9810 1.2667 1.5428 87.4461 23.1716 45.6239 42.2263 5.8415 1.4443 23.3666 0.6749 2.5481 2.8338 0.1816 5.5075 0.0550 0.0179 3.0524 88.8572 2.0971 9.0319 487.8778 90.3755 6.6718 0.7384 13.9457 1.1040 0.1350 0.3366 4.3758 3.2858 0.7256 14.2236 1.5085 1.5959 12.0173 6.3160 9.4436 25.5453 1.1573 27.7378 13.7815 17.4615 7.3287 10.6409 2.6342 0.3289 0.4219 4.0781 0.6472 328.0605 8.4254 12.7361 9.1912 19.4902 11.7258 9.6016 2.6076 2.7804 3.8449 14.5340 38.5806 58.2916 6.9807
temp: 298.150 k
press: 1.00000 atm
elementType: 17 8 8 6 6 6 6 6 6 6 6 6 6 6 6 6 6 6 6 1 1 1 1 1 1 1 1 1 1 1 1 1
symmnumber: 1
zpe: 641079.1 jmol-1
zpe.correction: 0.244174 hartree
zpe.thermalcorrener: 0.260400 hartree
zpe.thermalcorrenthalpy: 0.261344 hartree
zpe.thermalcorrgfe: 0.198282 hartree
zpe.sumelectzpe: -1226.695948 hartree
zpe.sumelectthermal: -1226.679723 hartree
zpe.sumelectthermalent: -1226.678779 hartree
zpe.sumelectthermalfe: -1226.741840 hartree
dipole: 2.8665 -0.4123 -2.3972
dipole: 3.7594
quadrupole: -127.4379 -103.7423 -111.0887
quadrupole: -3.0323 9.7012 5.5785
quadrupole: -13.3482 10.3473 3.0009 -3.0323 9.7012 5.5785
hfenergy: -1226.9401225 hartree
pointgroup: C01 [X(C16H13Cl1O2)]
dipole: 0.7720251 -0.6604969 -1.0748733 debye
polarizability: 161.3467428|4.9816145|238.595827|35.7402847|-3.7864998|154.7289205 unknown
InChI: InChI=1S/C16H13ClO2/c1-10(19-16(17)18)15-13-8-4-2-6-11(13)12-7-3-5-9-14(12)15/h2-10,15H,1H3
charge 0 multiplicity 1
32 atoms
Cl -2.931891 1.101995 2.631419
O  -1.889884 0.299002 0.372947
O  -3.550181 1.937205 0.108116
C  -0.157467 -0.09369 -1.315702
C  0.726789 1.005971 -0.716233
C  0.379481 -1.358471 -0.633336
C  -1.663472 0.215769 -1.133503
C  1.631288 0.447907 0.232477
C  1.419102 -1.011029 0.282246
C  0.720776 2.386111 -0.976937
C  0.03111 -2.707125 -0.827091
C  -2.65339 -0.803939 -1.701335
C  2.540079 1.275186 0.926957
C  2.083532 -2.006574 1.029895
C  1.633792 3.218151 -0.280222
C  0.697989 -3.708017 -0.075645
C  2.534352 2.665096 0.663532
C  1.710662 -3.358772 0.850325
C  -2.840044 1.183995 0.780635
H  -0.005831 -0.158964 -2.414357
H  -1.876213 1.22322 -1.539032
H  0.029262 2.8260 -1.705836
H  -0.732608 -2.998314 -1.555852
H  -2.5963 -1.75565 -1.14939
H  -3.68461 -0.418005 -1.633462
H  -2.429235 -0.998177 -2.766086
H  3.238328 0.854903 1.659239
H  2.880338 -1.742643 1.734124
H  1.643295 4.29664 -0.472244
H  0.43097 -4.761169 -0.216796
H  3.23151 3.322838 1.194409
H  2.215171 -4.14455 1.423536
