program: Gaussian 09
title: 000115090
version: EM64L-G09RevD.01
frameworkgroup: C1[X(C12H11FN2O3)]
method: RPBEPBE
basis: SDD
operation: Freq
keyword: #p
keyword: freq=noraman
keyword: PBEPBE/SDD
title: #p freq=noraman PBEPBE/SDD
converged: YES YES NO NO
title: Mulliken charges:
elementType: F O O O N N C C C C C C C C C C C C H H H H H H H H H H H
charge: -0.206181 -0.261116 -0.203909 -0.218062 -0.435156 -0.403604 0.110699 -0.492618 -0.004277 0.379009 0.166980 0.144841 -0.727200 0.155595 -0.533102 -0.334521 0.325243 -0.366117 0.233798 0.233716 0.279914 0.327729 0.222009 0.244023 0.217477 0.352560 0.272870 0.258627 0.260773
chargesum: 0.00000
title: Mulliken charges with hydrogens summed into heavy atoms:
elementType: F O O O N N C C C C C C C C C C C C
charge: -0.206181 -0.261116 -0.203909 -0.218062 -0.107427 -0.051044 0.110699 -0.025104 0.275637 0.379009 0.166980 0.144841 -0.043692 0.155595 -0.260232 -0.075894 0.325243 -0.105344
polarizability: 1.70969010e+02 -7.18957125e+00 1.71384269e+02 -2.68492287e+00 5.24640258e+00 9.90789350e+01
1716.lowfreq: -8.2568 -0.1881 0.0008 0.0009 0.0010 4.0039 51.7306 52.9167 82.0140
frequency: 51.7214 52.9076 82.0128 112.6617 153.4757 155.5727 187.9307 206.1563 229.2641 254.3902 271.7916 300.1907 359.6488 364.2929 375.4129 392.3373 438.9827 457.9440 484.7232 503.4965 518.1016 548.7711 551.7207 601.0122 619.2852 651.1773 667.2643 698.9589 711.9147 723.8024 753.9501 759.6385 796.9133 822.7805 861.7320 878.1848 904.0394 922.4556 945.2791 964.4911 973.3619 1043.9285 1061.0430 1108.2368 1110.6352 1139.3695 1144.7535 1152.3250 1187.4599 1197.5625 1226.9247 1248.7650 1255.6360 1298.5162 1308.0832 1316.4967 1345.4412 1358.3110 1375.2172 1388.9468 1395.5729 1418.4625 1448.6028 1463.3894 1473.7840 1478.4328 1591.0612 1622.8563 1678.5471 1725.4402 2993.8394 2997.0823 3014.8152 3069.1793 3094.3074 3102.5550 3160.7481 3165.6147 3185.6102 3584.5872 3601.1564
redmass: 8.8787 6.0266 6.3461 4.0186 4.8420 7.2019 4.9296 1.1458 3.5943 6.5466 3.6518 5.7803 5.3047 6.5180 6.3435 6.9975 3.3434 2.7122 2.6218 1.9754 2.5317 3.9112 4.5716 8.7234 5.0318 1.2819 4.6961 8.3350 4.9839 5.4099 4.3564 5.2192 3.9229 1.5215 3.4072 1.5392 2.4717 2.1209 1.3370 2.8852 2.2856 2.7818 3.0826 2.1069 2.0417 2.0828 2.3458 1.9531 2.5347 3.7770 2.6455 1.9820 1.6250 1.4573 2.6469 2.8112 1.2649 1.7149 1.8026 4.8627 1.2729 4.1737 1.0930 1.0622 2.4194 1.1388 8.3025 7.3946 8.6679 9.2921 1.0382 1.0634 1.0816 1.1022 1.0997 1.0997 1.0920 1.0886 1.0978 1.0802 1.0802
irintensity: 0.3240 0.2599 0.6592 1.0243 6.0957 1.4243 0.4556 0.2101 0.5461 2.5279 0.8973 0.2859 3.1264 1.9717 4.9418 11.2891 10.5561 26.0724 9.9719 55.4047 15.3506 0.8431 2.0769 12.2874 6.9140 124.1499 29.2736 16.3095 18.2212 29.5128 1.8225 26.7105 22.4269 46.5625 19.7588 17.3336 31.2827 17.5606 0.1892 6.3885 32.4598 6.0114 27.4911 19.5460 8.2886 27.8589 13.6741 18.2415 112.6552 123.1951 41.1883 11.5881 21.9023 40.0271 167.8416 74.0237 27.2318 7.6860 0.2514 9.6180 37.3453 27.0966 2.4426 15.4030 181.9422 44.4880 1.1773 4.4768 470.5836 478.2582 12.1533 21.3660 5.7017 11.5915 29.4288 18.5238 1.5666 2.0825 2.5585 82.5308 44.0387
temp: 298.150 k
press: 1.00000 atm
elementType: 9 8 8 8 7 7 6 6 6 6 6 6 6 6 6 6 6 6 1 1 1 1 1 1 1 1 1 1 1
symmnumber: 1
zpe: 567287.4 jmol-1
zpe.correction: 0.216068 hartree
zpe.thermalcorrener: 0.231185 hartree
zpe.thermalcorrenthalpy: 0.232129 hartree
zpe.thermalcorrgfe: 0.174014 hartree
zpe.sumelectzpe: -897.640528 hartree
zpe.sumelectthermal: -897.625412 hartree
zpe.sumelectthermalent: -897.624468 hartree
zpe.sumelectthermalfe: -897.682582 hartree
dipole: 0.4727 3.3798 -1.5064
dipole: 3.7304
quadrupole: -104.9298 -111.4262 -106.0991
quadrupole: 4.2410 3.1534 -6.6882
quadrupole: 2.5553 -3.9412 1.3859 4.2410 3.1534 -6.6882
hfenergy: -897.8565965 hartree
pointgroup: C01 [X(C12H11F1N2O3)]
dipole: -0.0501081 -1.3604162 -0.548444 debye
polarizability: 172.6522981|-7.0980376|169.4235343|1.9872063|-7.0338265|99.3563808 unknown
InChI: InChI=1S/C12H11FN2O3/c1-6-5-12(10(16)14-11(17)15-12)8-4-7(13)2-3-9(8)18-6/h2-4,6,14-15H,5H2,1H3
charge 0 multiplicity 1
29 atoms
F  2.775583 3.137033 -0.056188
O  1.260026 -2.252861 -0.125543
O  -1.386545 -0.56418 2.232569
O  -3.46013 2.287933 -0.896257
N  -1.66558 0.730134 -1.086276
N  -2.6063 0.993421 0.928224
C  -0.911545 -0.201618 -0.2250
C  -1.087652 -1.682433 -0.671096
C  -0.16867 -2.618514 0.131375
C  0.580105 0.143213 -0.143672
C  -1.627877 0.027577 1.155332
C  1.562548 -0.885244 -0.096735
C  -0.29849 -4.086459 -0.265169
C  -2.664466 1.440052 -0.434464
C  1.002405 1.49545 -0.125468
C  2.941051 -0.559971 -0.047834
C  2.369896 1.785768 -0.070965
C  3.357302 0.783016 -0.035245
H  -0.83824 -1.764559 -1.746995
H  -2.140944 -1.988829 -0.541778
H  -0.347333 -2.478732 1.215122
H  -1.461874 0.877628 -2.073321
H  -0.135365 -4.219008 -1.349365
H  0.448303 -4.692644 0.274597
H  -1.303721 -4.46465 -0.007689
H  -3.241937 1.352837 1.641165
H  0.274974 2.312213 -0.168861
H  3.667504 -1.376699 -0.017371
H  4.415873 1.053928 0.004808
