program: Gaussian 09
title: 000115067
version: EM64L-G09RevD.01
frameworkgroup: C1[X(C13H18O7)]
method: RPBEPBE
basis: SDD
operation: Freq
keyword: #pfreq=noraman
keyword: PBEPBE/SDD
title: #p freq=noraman PBEPBE/SDD
converged: YES YES NO NO
title: Mulliken charges:
elementType: O O O O O O O C C C C C C C C C C C C C H H H H H H H H H H H H H H H H H H
charge: -0.277696 -0.244720 -0.454356 -0.430538 -0.441115 -0.436730 -0.452044 -0.151698 -0.205577 -0.106198 -0.053398 -0.038440 -0.357595 0.359873 -0.386501 -0.330458 0.491721 -0.352878 -0.375228 -0.491480 0.205628 0.274195 0.245508 0.213094 0.218015 0.205197 0.229146 0.364586 0.335075 0.367781 0.361299 0.256899 0.262520 0.234499 0.232932 0.193194 0.192991 0.342496
chargesum: 0.00000
title: Mulliken charges with hydrogens summed into heavy atoms:
elementType: O O O O O O O C C C C C C C C C C C C C
charge: -0.277696 -0.244720 -0.089770 -0.095463 -0.073333 -0.075430 -0.109548 0.053929 0.068618 0.139310 0.159696 0.179575 0.076748 0.359873 -0.129602 -0.067939 0.491721 -0.118378 -0.142295 -0.105296
polarizability: 2.37493756e+02 -3.28321671e+00 1.53108488e+02 1.13299497e+00 1.61686216e+01 1.15046573e+02
1716.lowfreq: -16.3289 -5.7659 0.0006 0.0006 0.0009 3.8343 9.5960 23.9570 37.9146
frequency: -16.2651 23.9097 37.9098 46.1905 67.6262 83.7213 99.6976 105.6002 142.9516 172.9146 180.0542 218.1341 225.2297 245.3810 252.9963 259.9152 284.9351 322.5910 331.0752 340.7911 376.2378 396.0784 399.9549 406.8784 411.9212 444.5520 450.4759 471.8774 480.6718 485.6164 540.8664 569.1824 592.6148 601.7610 607.0337 641.0541 717.9329 758.2687 816.3463 824.3625 842.1756 843.4690 925.6963 929.3176 936.0076 950.9234 961.5431 966.2193 977.7047 980.2779 1006.9353 1007.6271 1021.5961 1030.4633 1048.9602 1079.1512 1080.5276 1095.7018 1116.8939 1118.4494 1156.9282 1176.4589 1178.1057 1181.6751 1194.2071 1198.1329 1211.0539 1220.3567 1242.9464 1250.4215 1265.2831 1289.2062 1306.0138 1306.8856 1328.9374 1330.7853 1339.2222 1346.2770 1363.4856 1373.0157 1379.8136 1387.0829 1398.7341 1409.1790 1415.5681 1460.0112 1476.7143 1502.9642 1592.9942 1623.1650 2905.8583 2915.4351 2941.1181 2942.3098 2973.3080 2992.2676 3002.6865 3068.9958 3098.4623 3130.1432 3134.5669 3164.2040 3172.2041 3525.3075 3534.4463 3537.9397 3546.1909 3550.3817
redmass: 4.3517 6.0842 5.7067 4.0195 6.2188 4.6814 6.4985 5.4717 5.4196 3.3445 6.2180 4.2398 4.7992 3.2902 2.0371 1.9167 4.8288 4.5960 2.3257 1.3418 2.4018 2.5967 3.0309 2.6065 2.9459 1.6004 1.3644 3.7160 1.7314 4.4843 3.5474 3.7637 3.9286 3.7530 3.7697 6.2607 3.9804 3.8470 2.7980 1.5580 1.9353 2.3929 4.1479 4.6676 6.1232 1.7595 6.0214 1.3864 2.5615 2.0040 3.3009 3.2710 2.6088 3.7498 2.9160 2.4642 3.9317 3.1601 1.5301 1.8142 1.3494 1.3581 1.2916 1.3048 1.0859 1.3552 2.1853 1.1846 1.2104 1.8092 1.2151 1.2171 1.3021 1.2744 1.2556 1.3195 1.3599 1.3625 1.2179 1.5323 1.3234 4.2885 1.3660 1.8720 3.1335 1.0847 1.1093 2.7584 7.1978 6.6204 1.0823 1.0822 1.0831 1.0553 1.0686 1.1077 1.0847 1.0860 1.0956 1.0896 1.0898 1.0946 1.0957 1.0659 1.0662 1.0655 1.0656 1.0656
irintensity: 0.5856 1.8010 1.0396 0.6997 0.2109 7.6725 3.3806 0.8672 1.0782 1.3325 2.0533 13.0378 11.8869 4.7160 99.2741 60.0657 11.3006 4.2444 10.7004 65.3917 43.9349 35.5556 25.2861 39.5260 4.6398 220.2631 52.7678 50.2831 125.7599 6.1698 3.1185 25.0548 6.7730 13.0195 49.6349 6.9863 2.7869 1.1917 20.6129 12.0452 43.1306 90.2946 126.3652 35.4171 397.3882 15.1822 111.5946 1.2752 8.1221 8.7868 17.2242 34.7469 19.0854 94.7096 83.7392 62.5434 8.2104 7.3641 3.2713 6.9538 67.6978 99.1922 12.5966 14.2812 0.2957 8.5371 231.4108 45.8003 21.6611 42.8634 4.2151 38.4583 8.1297 2.1686 24.0689 5.3166 10.7586 14.2653 23.6853 1.9122 16.1679 6.1661 42.2293 30.0228 1.5080 4.8748 0.8035 98.3665 9.1405 76.8498 5.5645 53.3656 42.5756 81.7300 52.9648 46.0514 32.8904 14.4139 18.8837 11.8355 16.6392 10.7560 3.1349 11.5736 8.0281 14.6994 17.5984 22.5023
temp: 298.150 k
press: 1.00000 atm
elementType: 8 8 8 8 8 8 8 6 6 6 6 6 6 6 6 6 6 6 6 6 1 1 1 1 1 1 1 1 1 1 1 1 1 1 1 1 1 1
symmnumber: 1
zpe: 785925.0 jmol-1
zpe.correction: 0.299343 hartree
zpe.thermalcorrener: 0.318989 hartree
zpe.thermalcorrenthalpy: 0.319933 hartree
zpe.thermalcorrgfe: 0.250695 hartree
zpe.sumelectzpe: -1031.138451 hartree
zpe.sumelectthermal: -1031.118805 hartree
zpe.sumelectthermalent: -1031.117861 hartree
zpe.sumelectthermalfe: -1031.187100 hartree
dipole: 0.5773 1.1227 0.8520
dipole: 1.5230
quadrupole: -89.3752 -130.5184 -116.0449
quadrupole: -9.2890 12.8706 5.3070
quadrupole: 22.6043 -18.5389 -4.0654 -9.2890 12.8706 5.3070
hfenergy: -1031.4377944 hartree
pointgroup: C01 [X(C13H18O7)]
dipole: 0.2137031 0.364245 0.4250833 debye
polarizability: 237.6117281|-0.9877675|144.2968217|0.6088589|22.7258618|123.7402674 unknown
InChI: InChI=1S/C13H18O7/c14-5-7-1-3-8(4-2-7)19-13-12(18)11(17)10(16)9(6-15)20-13/h1-4,9-18H,5-6H2
charge 0 multiplicity 1
38 atoms
O  1.24287 0.892784 -0.325634
O  -0.153811 -0.88139 -0.940512
O  4.49756 -1.707944 -0.173441
O  4.827748 1.024864 0.891208
O  1.836693 -2.771852 -0.023798
O  1.192987 3.564539 0.537384
O  -6.085082 -0.421116 1.318835
C  3.383081 -0.895407 0.321235
C  3.639236 0.60688 0.117957
C  2.13476 -1.401594 -0.427413
C  2.371125 1.402486 0.490079
C  0.920629 -0.532755 -0.06945
C  2.440273 2.898884 0.165102
C  -1.468224 -0.485579 -0.585174
C  -2.498339 -1.111583 -1.321779
C  -1.770857 0.472416 0.410943
C  -4.174085 0.166416 -0.050027
C  -3.839898 -0.781137 -1.051615
C  -3.123615 0.782915 0.670344
C  -5.616559 0.497472 0.250253
H  3.231668 -1.083243 1.412001
H  3.922008 0.805659 -0.930216
H  2.316397 -1.325606 -1.519364
H  2.133404 1.265438 1.572392
H  0.637449 -0.662693 1.000044
H  2.661058 3.023825 -0.915955
H  3.235324 3.384069 0.752699
H  5.341182 -1.320485 0.17695
H  4.61501 0.980324 1.860629
H  2.650739 -3.312489 -0.196843
H  0.461624 3.110995 0.042107
H  -2.228866 -1.849571 -2.082713
H  -0.97656 0.988304 0.957711
H  -4.639903 -1.275087 -1.615286
H  -3.362817 1.519349 1.446665
H  -5.705461 1.551406 0.589773
H  -6.235724 0.367706 -0.662756
H  -7.033924 -0.212303 1.523062
