program: Gaussian 09
title: 000115059
version: EM64L-G09RevD.01
frameworkgroup: C1[X(C10H26N4S2)]
method: RPBEPBE
basis: SDD
operation: Freq
keyword: #p
keyword: freq=noraman
keyword: PBEPBE/SDD
title: #p freq=noraman PBEPBE/SDD
converged: YES YES NO NO
title: Mulliken charges:
elementType: S S N N N N C C C C C C C C C C H H H H H H H H H H H H H H H H H H H H H H H H H H
charge: 0.018653 0.018553 -0.287199 -0.287354 -0.571225 -0.571295 -0.352859 -0.352777 -0.376889 -0.376881 -0.280763 -0.280935 -0.369135 -0.369310 -0.694579 -0.694368 0.174717 0.208690 0.174734 0.208612 0.241906 0.169754 0.169883 0.241810 0.219659 0.211934 0.219646 0.212032 0.240984 0.241146 0.205957 0.174116 0.206022 0.174149 0.280150 0.254383 0.280099 0.254472 0.258534 0.273189 0.258537 0.273249
chargesum: 0.00000
title: Mulliken charges with hydrogens summed into heavy atoms:
elementType: S S N N N N C C C C C C C C C C
charge: 0.018653 0.018553 -0.046215 -0.046208 -0.039503 -0.039510 0.030549 0.030569 0.034771 0.034812 0.150830 0.150743 0.010938 0.010861 -0.160046 -0.159797
polarizability: 2.58393989e+02 -3.03663222e-02 1.46834269e+02 1.27315125e+01 4.28984693e-02 1.47989900e+02
1716.lowfreq: -10.3063 -1.4004 0.0007 0.0011 0.0022 4.4395 11.5110 12.9960 22.0442
frequency: 10.5434 12.9684 21.6591 25.8005 34.7712 53.8863 58.9739 67.6667 77.3724 99.5965 104.1788 111.7674 121.1142 143.7461 148.2967 160.5227 177.9431 211.2843 230.5780 234.6709 235.6580 256.3740 265.5834 336.0663 341.4600 412.5269 436.2656 438.0137 481.8778 482.9396 596.5767 596.7934 669.8343 670.7653 684.7145 686.6052 766.8000 767.0363 771.6972 771.9441 868.0850 868.1779 954.3377 954.7674 980.1293 985.1941 1036.8417 1037.0489 1046.5232 1047.6035 1069.0582 1070.2118 1092.8771 1093.1323 1109.4637 1109.7015 1123.9630 1124.9849 1142.4231 1143.7958 1205.9953 1207.1505 1223.0786 1223.5869 1234.3501 1240.1019 1266.2946 1269.9081 1279.6380 1280.8811 1285.5277 1286.5116 1300.0545 1300.5432 1341.1652 1342.6425 1384.1104 1384.4999 1391.5311 1391.9497 1423.1256 1425.7004 1449.5898 1449.8940 1467.9801 1468.1730 1481.4599 1481.5077 1489.3806 1489.5397 1498.3203 1498.3939 1638.8844 1639.2492 2847.7573 2847.9377 2862.8695 2863.0381 2889.4393 2889.8423 2952.2803 2952.4708 2994.6585 2994.8798 3012.8459 3012.9873 3014.2616 3015.6464 3029.3699 3029.5314 3063.4121 3063.4761 3091.2065 3091.5795 3420.2907 3420.5215 3454.1195 3454.4491 3582.2503 3582.5650
redmass: 2.5001 5.6323 2.3440 2.7920 2.7527 4.5226 4.1174 2.9549 5.6005 1.8956 2.3377 2.9288 2.5146 1.8500 2.2395 3.1437 3.7918 2.3362 1.5223 1.4238 2.3714 3.8058 4.9373 3.4435 3.5215 16.0742 5.0036 5.1920 2.8199 2.8271 1.2846 1.2851 2.4385 2.2871 1.7338 1.8672 1.1467 1.1305 1.1371 1.1342 1.1913 1.1910 2.2925 2.2894 1.6216 1.6997 3.7980 3.7622 1.7056 1.6636 2.6996 2.6889 2.6127 2.6275 2.1675 2.1747 1.1959 1.1884 3.8902 3.9996 1.4795 1.4948 1.3133 1.3251 1.3177 1.2741 1.1790 1.1648 1.0708 1.0871 1.1436 1.1349 1.2739 1.2797 1.3339 1.3318 1.3736 1.3744 1.5309 1.5274 1.0984 1.0976 1.2010 1.2050 1.0745 1.0746 1.0883 1.0879 1.0841 1.0841 1.0863 1.0864 1.0941 1.0942 1.0713 1.0714 1.0716 1.0716 1.0701 1.0703 1.0686 1.0686 1.0862 1.0862 1.0855 1.0855 1.0578 1.0577 1.0891 1.0891 1.0962 1.0962 1.1066 1.1062 1.0740 1.0740 1.0448 1.0448 1.0976 1.0976
irintensity: 3.5555 0.5340 4.8557 2.2131 3.1584 1.6234 0.4252 0.5900 0.0488 0.0035 0.0626 0.0174 1.3369 1.7121 4.5980 2.7467 14.6037 0.6922 56.3361 7.5744 29.0116 19.4804 0.0032 27.2117 1.0443 0.2863 1.1889 0.6155 33.0233 32.4851 204.1402 201.7925 69.5556 31.6903 63.7996 64.8817 1.6723 5.6311 0.0615 18.5755 0.8488 1.2869 0.7271 2.0218 0.1915 18.9681 1.8871 12.2592 1.3932 3.7396 9.5033 9.1907 3.3698 1.4726 17.6713 10.9867 101.4292 2.3520 101.4838 2.2023 0.9496 0.0010 0.6471 1.8728 7.4591 0.2274 18.0065 1.0598 3.3055 1.0571 0.2141 3.0091 0.0650 1.4866 14.1551 0.5614 6.1120 12.7332 34.5615 4.9529 10.6938 3.3123 63.2631 5.0951 4.5635 4.7917 12.3799 3.0132 2.2260 2.2879 1.7737 6.5769 40.6951 39.3512 78.1254 12.0783 171.9433 182.8624 64.9935 81.4774 20.5524 23.0065 31.3162 30.3715 51.3783 50.5622 24.8533 5.9305 25.7459 18.4143 31.6883 67.6907 12.3623 10.8255 1.5937 1.5723 1.5653 1.5408 0.1408 0.1433
temp: 298.150 k
press: 1.00000 atm
elementType: 16 16 7 7 7 7 6 6 6 6 6 6 6 6 6 6 1 1 1 1 1 1 1 1 1 1 1 1 1 1 1 1 1 1 1 1 1 1 1 1 1 1
symmnumber: 1
zpe: 961855.0 jmol-1
zpe.correction: 0.366351 hartree
zpe.thermalcorrener: 0.389495 hartree
zpe.thermalcorrenthalpy: 0.390439 hartree
zpe.thermalcorrgfe: 0.307182 hartree
zpe.sumelectzpe: -1410.382007 hartree
zpe.sumelectthermal: -1410.358864 hartree
zpe.sumelectthermalent: -1410.357919 hartree
zpe.sumelectthermalfe: -1410.441176 hartree
dipole: -0.0169 0.7452 -0.0102
dipole: 0.7455
quadrupole: -88.4330 -122.2994 -117.1926
quadrupole: 0.1412 -25.1001 -0.0087
quadrupole: 20.8753 -12.9910 -7.8843 0.1412 -25.1001 -0.0087
hfenergy: -1410.7483585 hartree
pointgroup: C01 [X(C10H26N4S2)]
dipole: -0.0067295 -0.2931886 0.0032125 debye
polarizability: 258.6749443|0.0514778|146.8340532|-11.4451762|0.0417725|147.7091605 unknown
InChI: InChI=1S/C10H26N4S2/c11-3-1-5-13-7-9-15-16-10-8-14-6-2-4-12/h13-14H,1-12H2
charge 0 multiplicity 1
42 atoms
S  0.315856 1.531382 -1.090136
S  -0.314816 1.52342 1.096963
N  4.059395 -0.189966 -0.368072
N  -4.058506 -0.192923 0.363748
N  8.785951 -1.517308 0.42256
N  -8.785856 -1.513469 -0.434484
C  5.413547 0.307223 -0.031739
C  -5.413993 0.307421 0.037563
C  6.430359 -0.84917 0.015574
C  -6.42941 -0.849419 -0.025214
C  3.004185 0.846534 -0.393106
C  -3.00369 0.843722 0.396889
C  7.858005 -0.370443 0.349667
C  -7.859523 -0.366722 -0.342712
C  1.73379 0.272637 -1.036298
C  -1.732498 0.264772 1.033988
H  5.437595 0.861532 0.941758
H  5.71378 1.031184 -0.815825
H  -5.440585 0.876151 -0.927507
H  -5.713713 1.019219 0.832932
H  6.442485 -1.377081 -0.954516
H  6.108059 -1.588016 0.782227
H  -6.110342 -1.573748 -0.806896
H  -6.435561 -1.394821 0.935235
H  3.367515 1.693585 -1.004892
H  2.754969 1.257978 0.615322
H  -3.366805 1.68529 1.016313
H  -2.755605 1.264062 -0.608128
H  3.794517 -0.98159 0.236355
H  -3.795307 -0.977702 -0.250232
H  8.209474 0.301001 -0.457645
H  7.821715 0.243644 1.284714
H  -8.208206 0.28747 0.479825
H  -7.828823 0.26644 -1.265159
H  1.915751 0.002434 -2.092098
H  1.367854 -0.621222 -0.501827
H  -1.913403 -0.014423 2.087619
H  -1.366841 -0.624414 0.491634
H  8.536331 -2.205141 1.140769
H  9.776809 -1.261297 0.467287
H  -8.539984 -2.185051 -1.16915
H  -9.77747 -1.258578 -0.466607
