program: Gaussian 09
title: 000115034
version: EM64L-G09RevD.01
frameworkgroup: CS[SG(H3N3)]
method: RPBEPBE
basis: SDD
operation: Freq
keyword: #p
keyword: freq=noraman
keyword: PBEPBE/SDD
title: #p freq=noraman PBEPBE/SDD
converged: NO NO NO NO
title: Mulliken charges:
elementType: N N N H H H
charge: -0.531757 0.012003 -0.375640 0.305738 0.331263 0.258393
chargesum: 0.00000
title: Mulliken charges with hydrogens summed into heavy atoms:
elementType: N N N
charge: 0.105244 0.012003 -0.117247
polarizability: 3.87857112e+01 4.32443671e+00 2.18548028e+01 -2.53842589e-10 -5.72276051e-11 7.97557944e+00
1716.lowfreq: -0.0007 0.0009 0.0014 13.7102 24.7832 48.9843 428.0552 558.3244 655.9016
frequency: 428.0550 558.3240 655.8907 879.5843 1090.4466 1152.2727 1375.6928 1452.2453 1595.5611 3263.4292 3411.4353 3689.0469
redmass: 1.2066 2.4539 1.2525 1.1515 4.0696 1.5835 2.0365 2.5771 1.1227 1.0752 1.0488 1.0976
irintensity: 306.6388 25.1177 81.3285 73.5898 66.9816 88.2895 61.9720 53.2319 50.9596 7.2857 4.1641 54.5574
temp: 298.150 k
press: 1.00000 atm
elementType: 7 7 7 1 1 1
symmnumber: 1
zpe: 116946.8 jmol-1
zpe.correction: 0.044543 hartree
zpe.thermalcorrener: 0.048096 hartree
zpe.thermalcorrenthalpy: 0.049041 hartree
zpe.thermalcorrgfe: 0.020264 hartree
zpe.sumelectzpe: -165.737215 hartree
zpe.sumelectthermal: -165.733661 hartree
zpe.sumelectthermalent: -165.732717 hartree
zpe.sumelectthermalfe: -165.761494 hartree
dipole: -1.8475 -0.2248 0.0000
dipole: 1.8611
quadrupole: -12.8759 -17.9188 -19.3654
quadrupole: 3.6762 0.0000 0.0000
quadrupole: 3.8442 -1.1987 -2.6454 3.6762 0.0000 0.0000
hfenergy: -165.7817577 hartree
pointgroup: CS [SG(H3N3)]
dipole: 0.7317304 -0.0269009 0. debye
dipolederiv: -0.917755 -0.0415677 0. -0.5531843 -0.0011364 0. 0. 0. -0.7601328 1.2562618 0.108853 0. 0.2702799 -0.2307712 0. 0. 0. 0.0422048 -0.7587034 0.047167 0. 0.5617446 -0.0077324 0. 0. 0. -0.3921077 0.117322 0.0132753 0. -0.0520599 0.0474085 0. 0. 0. 0.4153583 0.2122142 -0.0133248 0. -0.0259308 0.1797546 0. 0. 0. 0.4313653 0.0906604 -0.1144027 0. -0.2008495 0.012477 0. 0. 0. 0.2633121 unknown
polarizability: 39.7098921|1.4830441|20.9306219|0.|0.|7.9755794 unknown
InChI: InChI=1S/H3N3/c1-3-2/h1H,2H2
charge 0 multiplicity 1
6 atoms
N  1.10959 0.24312 0.0000
N  -0.04986 -0.471518 0.0000
N  -1.110938 0.295547 0.0000
H  1.100299 1.271261 0.0000
H  1.967681 -0.299043 0.0000
H  -1.931772 -0.351768 0.0000
