program: Gaussian 09
title: 000014313
version: EM64L-G09RevD.01
frameworkgroup: C1[X(C9H7NO2)]
method: RPBEPBE
basis: SDD
operation: Freq
keyword: #pfreq=noraman
keyword: PBEPBE/SDD
title: #p freq=noraman PBEPBE/SDD
converged: NO YES NO NO
title: Mulliken charges:
elementType: O O N C C C C C C C C C H H H H H H H
charge: -0.143136 -0.165163 -0.451877 0.163154 0.189281 0.398357 -0.040809 -0.356351 0.040440 -0.380806 -0.236291 -0.814863 0.339161 0.270621 0.235930 0.237811 0.236950 0.240777 0.236815
chargesum: 0.00000
title: Mulliken charges with hydrogens summed into heavy atoms:
elementType: O O N C C C C C C C C C
charge: -0.143136 -0.165163 -0.112716 0.163154 0.189281 0.398357 -0.040809 -0.085730 0.040440 -0.144877 0.001520 -0.100321
polarizability: 1.57895090e+02 -3.31882454e+00 1.21990424e+02 -3.40275156e-03 -6.58933452e-04 4.73828901e+01
1716.lowfreq: -7.5631 -6.0332 -0.0005 0.0001 0.0005 6.4955 94.7970 112.3107 130.9619
frequency: 94.7963 112.3052 130.9615 202.2396 205.8421 287.4465 290.8028 341.6879 403.8493 457.3251 508.6058 529.7291 542.1407 566.3131 603.3535 635.5763 672.0193 735.3205 770.4582 822.5112 839.8157 876.1891 931.7041 947.9801 983.3903 1005.8253 1045.7838 1077.0258 1152.3234 1176.4340 1216.3424 1264.4620 1277.2427 1327.3222 1398.1597 1409.7166 1422.2673 1472.8115 1477.9767 1486.8359 1615.3072 1624.1892 1652.5577 1675.4800 2970.5501 3044.2127 3092.0090 3128.8364 3151.0751 3171.0400 3577.6339
redmass: 6.7376 1.1569 3.7703 3.8995 3.5646 4.7084 11.3872 4.6993 4.6260 7.1966 3.6328 4.7373 2.8656 7.1772 1.3881 5.8549 7.6060 6.0471 1.5423 3.4035 4.8658 5.3262 1.3761 2.7389 1.3623 2.2738 1.5247 1.6593 5.2327 1.2324 3.2450 2.0456 2.6463 2.1018 1.4127 3.0378 2.6454 1.0445 1.4967 1.9212 7.4533 7.5541 12.1720 10.3936 1.0387 1.0979 1.0970 1.0889 1.0903 1.0991 1.0795
irintensity: 0.2411 1.2682 0.0773 1.2359 0.6475 4.7352 3.7291 2.1192 0.7239 1.3757 2.2690 2.1543 10.2783 6.0115 124.6783 2.2686 7.8847 8.3710 43.3333 14.1458 6.9966 0.4324 0.4745 25.0568 0.2324 5.2663 6.3751 14.1905 81.4852 1.9151 25.2340 4.9884 50.4347 22.3770 3.9178 40.6962 54.1877 15.9882 67.2557 10.7099 166.5850 247.1742 182.4421 180.6611 25.8222 18.0906 12.5223 9.6956 4.5176 16.3728 33.9290
temp: 298.150 k
press: 1.00000 atm
elementType: 8 8 7 6 6 6 6 6 6 6 6 6 1 1 1 1 1 1 1
symmnumber: 1
zpe: 367288.1 jmol-1
zpe.correction: 0.139893 hartree
zpe.thermalcorrener: 0.149738 hartree
zpe.thermalcorrenthalpy: 0.150682 hartree
zpe.thermalcorrgfe: 0.104669 hartree
zpe.sumelectzpe: -551.533108 hartree
zpe.sumelectthermal: -551.523263 hartree
zpe.sumelectthermalent: -551.522318 hartree
zpe.sumelectthermalfe: -551.568331 hartree
dipole: -7.0195 -1.8705 0.0003
dipole: 7.2644
quadrupole: -81.3164 -61.8204 -70.2184
quadrupole: 0.0485 -0.0011 -0.0003
quadrupole: -10.1980 9.2980 0.9000 0.0485 -0.0011 -0.0003
hfenergy: -551.6730003 hartree
pointgroup: C01 [X(C9H7N1O2)]
dipole: 2.7268454 -0.8559962 -0.0001185 debye
dipolederiv: -0.8261731 0.2527206 0.0001196 0.4236956 -0.6416886 -0.0001277 -0.0001061 0.0001015 -0.2871383 -1.1479218 -0.2374772 -0.0001566 -0.4093926 -0.5129016 -0.0000729 0.0001382 0.0000506 -0.3173794 -1.4572369 -0.4381285 -0.0000113 0.0455467 -0.4010789 0.0000572 -0.000111 0.0000584 -0.3320314 0.9172405 0.6796058 0.0000042 0.5383824 0.36292 0.0000884 0.0001638 0.0000346 0.0482831 -0.8136254 0.2332318 0.0000174 -0.3660177 -0.1909858 0.0000014 0.0000671 0.0000355 -0.0228847 -0.4909878 -0.4386733 -0.0000106 -0.2989596 0.2146524 0.0000459 -0.0002109 0.0002395 -0.0452509 1.4176182 -0.3518866 -0.0001301 -0.2310133 0.59239 0.0001435 0.0000317 -0.0001167 0.1935032 0.2462432 -0.2283024 -0.0000369 0.1894335 0.0515262 -0.0000428 0.0000185 0.0000088 -0.09757 1.8275227 0.1665746 0.0002004 -0.2106475 0.367288 0.000023 -0.000102 -0.0001154 0.232853 0.2082166 0.0642442 -0.0000272 0.1462857 0.2154714 0.0000007 -0.0000239 -0.0000585 -0.1351809 -0.1046975 0.2759885 0.0000162 0.14803 -0.1981887 -0.0000239 -0.0000013 -0.0000444 -0.1740672 0.0726872 0.0031224 -0.0000398 0.0278359 -0.1224155 -0.0000504 0.0001445 -0.0003646 0.0805035 0.1479449 0.0234903 -0.0000301 0.0157182 0.1673383 -0.0000151 0.0000222 0.0000233 0.3391067 0.0848676 0.0593291 0.000002 0.0207233 -0.0168278 0.0000019 0.0000113 -0.0000027 0.1576106 -0.1002864 0.0369919 0.0000072 0.0631983 0.085197 0.0000171 -0.0000196 0.0000314 0.1467558 -0.0086277 -0.0953549 0.0000071 -0.0975745 -0.0245909 0.0000142 -0.0000111 0.000029 0.1689981 0.0791494 -0.0310488 -0.0888005 0.025513 -0.0177499 -0.0683721 -0.0362925 -0.1082673 -0.0367442 -0.1306439 0.0571676 -0.0003383 -0.05592 0.0874669 -0.0000678 -0.000302 0.0001022 0.1168468 0.0787103 -0.0315949 0.0892073 0.0251627 -0.0178224 0.0683795 0.0365831 0.1082549 -0.0362136 unknown
polarizability: 158.1164481|1.7371825|121.7690655|-0.0033707|0.0008071|47.3828901 unknown
InChI: InChI=1S/C9H7NO2/c1-5-3-2-4-6-7(5)10-9(12)8(6)11/h2-4,10H,1H3
charge 0 multiplicity 1
19 atoms
O  -2.441876 1.708211 -0.000018
O  -3.105886 -1.283872 -0.000095
N  -0.733737 -1.425673 0.0000
C  0.359528 -0.516446 0.000009
C  -0.125482 0.823514 0.000001
C  1.736496 -0.82237 -0.000022
C  -1.602337 0.778166 0.000224
C  0.767359 1.913091 -0.000111
C  -1.970332 -0.759516 -0.000222
C  2.615649 0.295774 -0.000112
C  2.153506 1.637179 -0.000176
C  2.239267 -2.252748 -0.000081
H  -0.647501 -2.441996 -0.000031
H  0.383348 2.938303 -0.000091
H  3.695919 0.105317 -0.000117
H  2.878624 2.456906 -0.000231
H  1.893483 -2.808007 -0.893595
H  3.341176 -2.284986 0.001497
H  1.890895 -2.809048 0.891771
