program: Gaussian 09
title: 000115019
version: EM64L-G09RevD.01
frameworkgroup: C1[X(C17H16O4)]
method: RPBEPBE
basis: SDD
operation: Freq
keyword: #pfreq=noraman
keyword: PBEPBE/SDD
title: #p freq=noraman PBEPBE/SDD
converged: YES YES NO NO
title: Mulliken charges:
elementType: O O O O C C C C C C C C C C C C C C C C C H H H H H H H H H H H H H H H H
charge: -0.243881 -0.222244 -0.209271 -0.224268 -0.383355 0.443459 0.385261 -0.062279 -0.507993 -0.064782 0.128582 -0.375985 -0.406568 0.049394 0.122724 -0.238383 -0.235031 -0.246342 -0.594957 -0.501306 -0.497184 0.279790 0.293151 0.246442 0.240525 0.253082 0.227573 0.225661 0.229856 0.219299 0.234776 0.233817 0.222902 0.259100 0.252116 0.231690 0.234632
chargesum: 0.00000
title: Mulliken charges with hydrogens summed into heavy atoms:
elementType: O O O O C C C C C C C C C C C C C C C C C
charge: -0.243881 -0.222244 -0.209271 -0.224268 -0.103566 0.443459 0.385261 -0.062279 -0.214842 0.181660 0.128582 -0.135460 -0.153486 0.049394 0.122724 -0.010809 -0.009370 -0.016486 -0.140883 0.214513 0.221254
polarizability: 2.44621745e+02 -3.99018401e+00 2.42351490e+02 -7.54803824e+00 -3.44705928e+00 1.41467941e+02
1716.lowfreq: -6.0238 -3.4425 -1.7806 -0.0009 -0.0004 0.0002 23.4913 29.2305 31.8421
frequency: 23.4669 29.1731 31.8231 52.2667 58.9055 70.6157 80.3628 91.1526 100.0940 149.3261 172.1929 176.1083 195.0861 200.1354 229.1144 255.8230 263.7943 280.1513 338.9227 355.7379 363.4342 374.2192 387.2047 403.8700 413.8582 445.1200 469.2271 478.5991 542.2045 580.0370 616.5133 622.9480 652.7665 673.7633 700.3886 704.3567 733.5897 759.2007 794.9276 831.9475 855.7559 864.5767 883.8599 902.4295 926.6164 939.6592 952.6462 973.4061 979.9724 991.1314 995.9994 1012.5810 1029.6236 1059.9443 1077.8126 1100.1690 1102.5438 1112.7331 1123.9971 1139.0674 1163.8964 1172.9717 1187.7861 1192.1787 1202.6633 1230.0309 1269.6045 1272.1738 1287.8491 1320.9341 1323.7222 1346.7425 1377.8542 1419.7209 1431.2718 1436.4513 1439.2341 1450.3423 1452.5882 1453.4205 1461.5088 1483.1377 1512.7212 1521.0842 1550.0349 1589.9573 1613.2192 1643.2024 1653.3485 2988.4893 2998.1616 3005.9364 3080.8296 3097.3607 3109.5157 3117.5853 3120.5139 3125.9750 3135.2126 3137.3521 3138.4806 3147.3550 3152.2710 3163.8472 3199.8798
redmass: 4.8706 4.0074 3.4151 5.8135 2.7085 3.5495 6.3598 4.4973 3.1315 1.6169 3.2375 3.9258 1.4616 2.5636 4.5089 2.7711 3.8371 6.1406 3.5135 4.3588 3.8830 5.4674 9.6535 2.8307 5.8543 6.9929 5.3546 3.8436 3.2200 5.9016 6.1681 4.6858 4.2432 3.6086 4.4505 2.3275 2.0737 3.0153 6.6939 3.0242 1.2497 5.5928 6.0369 1.7053 1.4225 2.2106 1.3325 3.9134 1.3902 5.8452 1.3140 1.1760 2.1578 5.4503 1.6828 1.2467 1.2513 2.1819 2.1032 1.5212 2.4228 1.0509 2.9434 1.1353 2.2935 1.4722 1.3633 4.4022 1.2185 2.7380 1.5912 2.6346 7.9379 1.1977 1.2179 2.2167 1.2034 1.0631 1.0625 1.0634 1.0652 2.2571 9.3869 8.5136 8.4255 6.1482 6.0652 5.2978 6.7461 1.0813 1.0306 1.0285 1.0725 1.0801 1.1017 1.1042 1.0853 1.0870 1.1064 1.1061 1.0918 1.0960 1.0928 1.1015 1.1150
irintensity: 0.5254 0.2465 3.7974 0.5914 16.7859 0.6559 1.6368 2.6795 0.2566 0.1589 1.1966 3.0004 2.3281 3.7271 2.6903 2.0722 3.8403 1.0520 0.2729 0.2942 7.3615 11.2023 10.0955 0.0611 3.1765 2.6647 4.7006 7.0413 6.0422 0.6867 0.8232 13.0666 51.0710 33.3066 7.0778 30.7602 57.2331 16.3695 11.2435 34.5461 0.4234 21.4151 2.5499 14.0481 1.4319 0.4294 71.6175 53.3402 0.4302 0.3833 1.1258 18.4115 4.5943 44.1910 2.2285 0.8168 1.8221 79.7632 12.2668 13.8357 167.5056 0.0078 182.3202 4.3490 12.4856 11.9649 2.0543 375.8207 1.2792 20.1809 11.9802 1.7630 0.1062 10.7724 32.2516 7.2078 75.0149 45.9621 6.2369 28.1390 34.8495 25.4684 36.1882 318.6745 251.0253 1.6421 11.2589 21.8653 6.3929 10.6590 57.6344 45.4763 7.0872 5.5000 35.1832 28.5461 6.4026 0.0115 24.7004 18.4105 16.5916 36.5368 1.7413 24.5216 16.1196
temp: 298.150 k
press: 1.00000 atm
elementType: 8 8 8 8 6 6 6 6 6 6 6 6 6 6 6 6 6 6 6 6 6 1 1 1 1 1 1 1 1 1 1 1 1 1 1 1 1
symmnumber: 1
zpe: 747100.0 jmol-1
zpe.correction: 0.284555 hartree
zpe.thermalcorrener: 0.305226 hartree
zpe.thermalcorrenthalpy: 0.306170 hartree
zpe.thermalcorrgfe: 0.232836 hartree
zpe.sumelectzpe: -956.700098 hartree
zpe.sumelectthermal: -956.679428 hartree
zpe.sumelectthermalent: -956.678484 hartree
zpe.sumelectthermalfe: -956.751818 hartree
dipole: -0.2282 0.4669 0.6171
dipole: 0.8068
quadrupole: -111.7305 -118.1036 -120.9971
quadrupole: 2.2926 -1.4824 8.7713
quadrupole: 5.2132 -1.1599 -4.0534 2.2926 -1.4824 8.7713
hfenergy: -956.9846534 hartree
pointgroup: C01 [X(C17H16O4)]
dipole: -0.0925399 0.1317661 0.2735439 debye
polarizability: 244.606696|-2.1371398|239.9768867|-10.1227326|14.6005351|143.857593 unknown
InChI: InChI=1S/C17H16O4/c1-4-12(11-8-6-5-7-9-11)13-10-14(18)16(20-2)17(21-3)15(13)19/h4-10,12H,1H2,2-3H3
charge 0 multiplicity 1
37 atoms
O  3.547137 1.451733 -0.743389
O  4.038966 -1.084759 -0.242858
O  0.80381 2.383871 -0.735685
O  1.807736 -2.832523 0.522311
C  -1.411965 0.910438 0.258279
C  -0.04014 0.266893 0.062295
C  -2.593828 0.0268 -0.169097
C  1.076487 1.191586 -0.362822
C  0.236285 -1.046507 0.308396
C  -1.464305 1.334665 1.728377
C  2.463389 0.669903 -0.379182
C  -2.551036 -0.686077 -1.396624
C  -3.78058 -0.031955 0.603158
C  2.720697 -0.687845 -0.150224
C  1.606907 -1.604299 0.228111
C  -3.659199 -1.442229 -1.83399
C  -4.891318 -0.791973 0.16977
C  -4.835513 -1.501943 -1.049885
C  -1.367113 2.613998 2.163406
C  3.557738 2.911646 -0.48822
C  4.443634 -2.509281 -0.292892
H  -1.416012 1.834542 -0.353569
H  -0.54467 -1.760898 0.589618
H  -1.537791 0.508272 2.452429
H  -1.646976 -0.645762 -2.015853
H  -3.841971 0.529758 1.541765
H  -3.606921 -1.982406 -2.786045
H  -5.799445 -0.825054 0.78241
H  -5.695508 -2.090865 -1.387676
H  -1.379525 2.856581 3.232119
H  -1.267265 3.450875 1.46177
H  4.617889 3.187794 -0.594763
H  3.203096 3.135622 0.533552
H  2.92955 3.441996 -1.218688
H  4.28448 -2.999298 0.679586
H  5.513583 -2.45985 -0.546156
H  3.8814 -3.05475 -1.068935
