program: Gaussian 09
title: 000114966
version: EM64L-G09RevD.01
frameworkgroup: C1[X(C35H24)]
method: RPBEPBE
basis: SDD
operation: Freq
keyword: #p
keyword: freq=noraman
keyword: PBEPBE/SDD
title: #p freq=noraman PBEPBE/SDD
converged: YES YES NO NO
title: Mulliken charges:
elementType: C C C C C C C C C C C C C C C C C C C C C C C C C C C C C C C C C C C H H H H H H H H H H H H H H H H H H H H H H H H
charge: -0.415487 -0.598840 -0.596604 0.376465 0.416774 0.006348 0.002543 0.274214 0.281646 -0.026325 -0.031371 0.474907 0.473611 0.488886 0.485227 0.475895 0.475494 -0.466636 -0.481647 -0.447608 -0.438431 -0.504992 -0.504173 -0.523681 -0.527133 -0.483861 -0.485442 -0.489517 -0.490582 -0.471578 -0.472572 -0.466988 -0.468897 -0.243843 -0.243836 0.219301 0.246386 0.221349 0.220658 0.237047 0.215797 0.234847 0.233491 0.245834 0.249559 0.239757 0.237787 0.236327 0.239762 0.239157 0.237216 0.237371 0.235760 0.243811 0.243409 0.241298 0.239714 0.227053 0.225342
chargesum: 0.00000
title: Mulliken charges with hydrogens summed into heavy atoms:
elementType: C C C C C C C C C C C C C C C C C C C C C C C C C C C C C C C C C C C
charge: 0.050200 -0.156832 -0.143760 0.376465 0.416774 0.006348 0.002543 0.274214 0.281646 -0.026325 -0.031371 0.474907 0.473611 0.488886 0.485227 0.475895 0.475494 -0.231789 -0.248156 -0.201774 -0.188872 -0.265234 -0.266387 -0.287354 -0.287372 -0.244704 -0.248226 -0.252146 -0.254822 -0.227767 -0.229163 -0.225689 -0.229183 -0.016790 -0.018494
polarizability: 4.28565466e+02 -5.27646641e+01 5.26320024e+02 4.23513715e+01 1.69232846e+01 2.64403625e+02
1716.lowfreq: -12.7277 -6.6986 -0.0002 0.0002 0.0004 1.8783 7.0811 11.3395 24.0019
frequency: 6.4673 10.4593 23.6954 39.5085 49.3973 80.7191 105.7007 115.0196 142.6602 167.1712 185.6740 211.8364 219.3483 223.6538 261.1468 263.0024 269.3059 274.8535 291.4618 333.0441 350.6074 390.3721 400.5653 407.0155 409.4598 425.2941 432.0850 450.5994 463.2285 478.7542 490.3431 503.6835 506.4010 509.6612 512.0610 515.7025 523.5877 526.5803 535.8534 553.6969 557.5600 574.7191 577.7858 618.8164 631.5149 678.0234 686.8347 687.8529 695.4951 697.2685 707.1459 734.8812 740.1163 752.7743 762.5190 767.9774 768.9520 782.2261 808.0945 809.4741 812.2656 814.7827 829.5637 837.1908 850.4452 858.0919 861.4774 874.9527 875.8326 876.5834 889.4613 913.9368 915.1756 956.3705 961.6332 965.7587 968.1793 973.1783 975.0255 978.9639 983.7389 985.6548 989.7618 990.0887 1013.3095 1032.5632 1062.7359 1067.4699 1095.7467 1107.1155 1110.9933 1112.4884 1145.9855 1154.2850 1158.9807 1172.9452 1173.8041 1179.4214 1182.7426 1185.0641 1195.3910 1196.0669 1228.0407 1229.0926 1244.8069 1245.2246 1251.5434 1252.2632 1258.1017 1258.1820 1278.9908 1289.7797 1318.5060 1333.8522 1337.1763 1347.4005 1377.7499 1378.7226 1389.8524 1391.9122 1407.2850 1408.4793 1425.5040 1426.6843 1429.1128 1431.1028 1436.2912 1436.4618 1462.2587 1463.3859 1470.3340 1479.2662 1490.4558 1493.7584 1494.6221 1511.8134 1513.8383 1548.4083 1549.0542 1593.5197 1594.2172 1603.7038 1603.8583 1610.4072 1611.6106 1635.3015 1636.6047 2976.3351 2981.8710 2989.7390 3026.0516 3032.9393 3056.6317 3113.9323 3116.7330 3117.7392 3119.2954 3121.2243 3122.2916 3125.1395 3125.4262 3131.0000 3131.9846 3138.2756 3140.8518 3143.3173 3144.6535 3155.1873 3156.3345 3157.0777 3159.2837
redmass: 5.8526 5.9103 5.1169 5.5989 5.3650 4.9776 4.7392 4.5278 4.3241 2.7708 4.4848 4.0142 3.9174 3.7856 4.2148 4.2801 3.8892 3.1493 2.8795 3.7135 4.1634 5.0142 5.8932 4.3646 3.9748 3.8991 3.7267 4.5873 5.1676 4.4772 4.0076 3.8140 4.2090 4.5182 4.0228 3.8885 3.7081 4.6369 4.7581 3.0792 3.1793 6.0245 5.8256 3.8440 3.7606 3.9374 6.8371 6.7684 3.8654 3.4978 4.0173 2.4531 2.7051 3.2885 2.2506 1.2500 1.5302 1.8885 4.1219 4.1712 1.5412 1.4968 1.9574 2.0854 3.6727 2.8173 2.2351 2.1821 1.9898 2.2051 3.4372 1.4578 1.4577 1.4606 1.3707 3.8435 4.5587 1.3407 1.4095 2.1673 1.4057 1.4012 1.4085 1.4042 2.4456 3.0650 2.8438 2.2482 1.9397 2.4402 2.4056 2.0324 1.3197 1.3876 1.2725 1.3685 1.4781 1.6297 1.3801 1.2468 1.2793 1.3189 1.8774 1.8599 1.4977 1.5577 1.7855 1.7718 2.1523 2.2346 1.2937 1.4754 1.4650 2.0865 2.9040 1.6229 4.0537 4.2355 2.3476 2.2599 2.5571 2.6218 4.1245 4.3547 6.2078 5.8253 2.2285 2.2344 3.6388 3.9447 1.2193 1.1360 1.1727 4.7945 3.9544 4.1294 4.0841 4.9073 4.9411 6.7916 6.8795 6.9504 6.9050 6.4562 6.4574 7.4533 7.4986 1.0598 1.0601 1.0620 1.0995 1.1002 1.1033 1.0868 1.0869 1.0860 1.0862 1.0859 1.0861 1.0878 1.0878 1.0916 1.0917 1.0968 1.0970 1.0979 1.0979 1.0988 1.0989 1.0959 1.0954
irintensity: 0.0017 0.0026 0.0209 0.0975 0.2375 0.4939 0.8064 0.0858 0.1304 0.3738 1.5441 7.2409 8.4574 6.2195 0.0187 0.0360 0.0354 0.3899 0.7656 0.7694 0.5347 0.0969 0.6363 0.1550 1.2790 0.2042 0.2759 0.0441 0.4662 1.3774 1.3932 0.3590 1.2735 2.1607 1.6136 1.4112 0.1607 1.7116 0.5718 1.1258 1.0625 0.2315 0.3754 3.1950 11.1909 0.1800 0.0599 0.0215 3.0053 4.1164 8.6667 20.5699 23.5525 1.0789 1.6379 15.5104 8.2809 7.3951 3.3934 4.3382 1.1016 4.1160 3.1341 4.3553 1.6792 1.5239 1.6630 149.4382 68.6745 64.8912 9.7676 0.9222 1.2304 1.4062 0.1100 2.2668 0.7177 0.4524 1.4761 0.6294 1.8105 0.4987 2.0223 1.4476 3.1728 2.3160 1.4862 10.5773 4.9291 3.2667 0.1039 3.0619 5.7287 0.2714 0.5911 3.6079 1.0215 2.1129 1.2445 6.4028 9.0007 32.7148 1.1034 1.0016 0.6030 2.3133 4.2589 14.5652 2.2528 0.2369 6.7844 4.8166 2.4831 0.7318 0.3377 7.1597 8.6148 10.3990 0.4820 0.2959 1.6789 1.2788 1.8126 2.2053 0.1335 0.2312 4.4267 9.1970 3.8255 6.8707 2.4944 13.2907 7.4757 4.4663 2.6697 6.5121 9.6690 0.3900 0.4362 5.7539 6.9011 2.8278 3.6807 6.4310 10.0604 0.8677 1.4767 18.8367 44.2996 42.6670 5.3167 11.7438 59.0661 15.0127 13.9174 1.2621 1.0529 0.3959 0.5291 2.8579 2.0957 16.8308 15.6462 27.0780 20.8701 51.6075 46.4123 40.7107 47.4164 15.0063 18.7785
temp: 298.150 k
press: 1.00000 atm
elementType: 6 6 6 6 6 6 6 6 6 6 6 6 6 6 6 6 6 6 6 6 6 6 6 6 6 6 6 6 6 6 6 6 6 6 6 1 1 1 1 1 1 1 1 1 1 1 1 1 1 1 1 1 1 1 1 1 1 1 1
symmnumber: 1
zpe: 1242003.6 jmol-1
zpe.correction: 0.473054 hartree
zpe.thermalcorrener: 0.497987 hartree
zpe.thermalcorrenthalpy: 0.498931 hartree
zpe.thermalcorrgfe: 0.416144 hartree
zpe.sumelectzpe: -1345.919064 hartree
zpe.sumelectthermal: -1345.894131 hartree
zpe.sumelectthermalent: -1345.893187 hartree
zpe.sumelectthermalfe: -1345.975974 hartree
dipole: -0.4710 -0.4504 0.3026
dipole: 0.7185
quadrupole: -193.0212 -177.2117 -197.9842
quadrupole: -7.4102 8.2419 1.2268
quadrupole: -3.6155 12.1940 -8.5785 -7.4102 8.2419 1.2268
hfenergy: -1346.3921178 hartree
pointgroup: C01 [X(C35H24)]
dipole: 0.1913556 0.1821569 0.1005662 debye
polarizability: 423.9513031|-55.5890129|524.4474627|-46.2230197|-29.1877837|270.8903486 unknown
InChI: InChI=1S/C35H24/c1(4-22-10-12-28-16-14-24-6-2-8-26-18-20-30(22)34(28)32(24)26)5-23-11-13-29-17-15-25-7-3-9-27-19-21-31(23)35(29)33(25)27/h2-3,6-21H,1,4-5H2
charge 0 multiplicity 1
59 atoms
C  -0.102332 2.892586 1.097876
C  1.359328 3.418032 0.967735
C  -0.885897 2.915134 -0.245675
C  2.251479 2.547273 0.091809
C  -2.2589 2.270296 -0.129765
C  3.559321 0.47099 -0.342222
C  -3.742876 0.276318 0.016501
C  2.756885 1.28369 0.545826
C  -2.422816 0.845783 -0.138599
C  4.063564 -0.805176 0.093487
C  -3.925653 -1.151414 0.011205
C  3.862806 0.935475 -1.674628
C  -4.890004 1.137614 0.177284
C  3.775868 -1.283435 1.423569
C  -2.790441 -2.027102 -0.149289
C  4.860638 -1.616338 -0.797127
C  -5.245206 -1.717907 0.166368
C  2.575903 2.977231 -1.219174
C  -3.405233 3.08811 0.025328
C  2.49999 0.777462 1.880423
C  -1.30447 -0.06392 -0.299707
C  3.362924 2.19727 -2.088876
C  -4.695301 2.543408 0.177249
C  2.986435 -0.447519 2.299808
C  -1.480451 -1.435761 -0.305133
C  4.666982 0.106314 -2.546726
C  -6.201871 0.545854 0.330903
C  5.145795 -1.120775 -2.1269
C  -6.374126 -0.825948 0.326184
C  4.277633 -2.54812 1.835307
C  -2.989347 -3.434644 -0.15238
C  5.342274 -2.87527 -0.345954
C  -5.399976 -3.130816 0.157868
C  5.051953 -3.334512 0.956595
C  -4.282293 -3.978108 -0.000229
H  -0.643824 3.512284 1.839437
H  -0.094885 1.86097 1.496125
H  1.789582 3.51226 1.983982
H  1.330063 4.441554 0.546785
H  -0.2804 2.411772 -1.022657
H  -1.000191 3.967293 -0.571042
H  2.199448 3.948846 -1.561107
H  -3.277588 4.177602 0.025701
H  1.913083 1.386152 2.574468
H  -0.296531 0.344495 -0.42312
H  3.593421 2.561795 -3.096762
H  -5.561713 3.205148 0.293795
H  2.778569 -0.806081 3.314891
H  -0.617771 -2.100889 -0.429671
H  4.888631 0.475015 -3.555201
H  -7.062499 1.21447 0.451803
H  5.752611 -1.741489 -2.7966
H  -7.372765 -1.263265 0.443314
H  4.056432 -2.907985 2.846887
H  -2.123989 -4.096392 -0.275004
H  5.945642 -3.490174 -1.024075
H  -6.402533 -3.55872 0.275737
H  5.431419 -4.30741 1.287411
H  -4.419995 -5.064929 -0.005138
