program: Gaussian 09
title: 000114891
version: EM64L-G09RevD.01
frameworkgroup: C1[X(C15H22N2)]
method: RPBEPBE
basis: SDD
operation: Freq
keyword: #pfreq=noraman
keyword: PBEPBE/SDD
title: #p freq=noraman PBEPBE/SDD
converged: YES YES NO NO
title: Mulliken charges:
elementType: N N C C C C C C C C C C C C C C C H H H H H H H H H H H H H H H H H H H H H H
charge: -0.436596 -0.051978 0.157210 0.283891 -0.486156 -0.455520 0.302545 -0.361013 -0.777354 0.226403 -0.760454 -0.571588 -0.628048 -0.386325 0.454679 -0.420425 -0.831622 0.201514 0.210400 0.180124 0.219767 0.257666 0.221911 0.178043 0.232791 0.212648 0.204851 0.205041 0.234268 0.218153 0.226618 0.224062 0.225362 0.182890 0.222074 0.220606 0.221455 0.219730 0.222377
chargesum: 0.00000
title: Mulliken charges with hydrogens summed into heavy atoms:
elementType: N N C C C C C C C C C C C C C C C
charge: -0.178929 -0.051978 0.157210 0.283891 -0.074242 -0.055628 0.302545 0.038940 -0.127064 0.226403 -0.102993 -0.344970 0.004266 -0.164251 0.454679 -0.199819 -0.168061
polarizability: 2.11749818e+02 1.50007466e+01 1.44565048e+02 -3.16900979e-01 9.92500094e+00 1.60026246e+02
1716.lowfreq: -12.5575 -6.6138 -0.0006 0.0001 0.0005 11.1362 40.4809 48.2119 70.0402
frequency: 40.4695 48.1646 69.9899 114.1619 135.8820 169.8913 197.4753 215.2017 234.8763 237.9752 251.9269 267.5903 285.4295 304.3035 315.7244 326.1263 336.4655 355.4553 368.7155 389.5885 428.5977 447.6271 470.8443 497.6886 523.7140 548.9766 584.6826 596.4343 641.0177 674.6975 722.3718 748.3325 794.1732 801.4491 815.2839 851.2905 888.4664 890.5356 900.8503 927.6529 929.7697 944.0610 970.4624 993.1078 1001.3429 1018.3113 1045.1942 1053.4645 1074.7146 1091.6393 1099.8163 1110.3764 1115.4157 1141.8961 1157.1864 1170.7534 1191.6117 1206.7240 1212.1041 1230.3387 1247.3413 1277.7095 1279.2998 1286.6925 1296.1653 1333.9651 1350.7900 1351.8903 1375.9318 1378.6419 1391.8143 1396.5321 1419.3058 1434.6755 1441.4567 1458.2810 1462.7260 1464.1085 1466.7155 1470.3827 1471.6871 1480.5681 1481.4492 1487.4722 1487.9237 1491.7095 1498.2030 1605.6414 1633.7775 2796.5327 2829.7921 2844.4018 2963.7092 2971.5967 2975.8648 2980.7912 2985.5464 3005.6637 3023.1874 3034.6228 3036.5761 3056.4179 3062.5122 3068.2282 3072.2740 3084.8993 3092.8992 3099.0283 3113.2714 3139.6569 3550.1547
redmass: 1.1701 2.6565 3.0985 2.8678 2.8612 2.3523 2.8084 1.8659 2.1312 1.7322 1.1868 2.1734 1.0296 2.3709 2.6241 2.0361 2.2716 2.5528 2.1283 2.3633 2.9368 4.1131 3.8789 3.0098 3.1102 3.9585 3.5853 3.5329 3.2120 4.4913 3.8681 3.9633 2.3023 1.4457 2.9643 2.2810 2.1084 1.6367 2.0885 1.4329 1.9746 1.8117 1.6513 1.4207 1.7536 1.6470 1.5014 2.5668 1.9538 2.2407 2.0415 1.9405 1.5048 1.3427 2.9750 2.3855 2.4414 1.6512 2.4651 1.3212 2.2737 1.8273 1.8621 2.3524 1.8112 1.5794 2.4261 1.5471 1.4489 1.2217 1.2195 1.2409 2.1413 1.1711 3.9481 1.0927 1.0565 1.0687 1.0689 1.0467 1.0792 1.1097 1.0718 1.0848 1.0782 1.0870 3.4678 6.4373 7.3480 1.0708 1.0623 1.0691 1.0372 1.0372 1.0377 1.0629 1.0831 1.0705 1.0870 1.1008 1.0977 1.0987 1.0974 1.1002 1.0979 1.0998 1.0984 1.0908 1.0872 1.0962 1.0776
irintensity: 0.2243 0.1258 0.8440 0.3153 3.5472 2.0064 2.2843 1.0634 0.6418 2.4781 0.5779 7.0927 0.0429 0.3725 4.8044 23.7090 13.4077 3.3379 87.0494 3.1507 5.1158 4.3915 30.2111 4.5892 3.7277 3.4780 6.2989 2.2682 2.9473 0.5050 1.0103 1.1252 8.3248 48.9903 10.6904 2.0608 2.5422 4.0845 3.5231 0.4560 0.9241 2.1294 1.3910 3.0230 3.9932 5.0654 9.1885 3.4152 23.6067 19.3798 7.2859 14.5915 6.1852 9.1014 17.3912 11.9919 30.0198 2.2621 17.8585 7.1757 6.6304 1.7230 56.9995 9.6088 7.3587 13.2678 36.9429 14.2505 3.7793 11.3703 27.2282 1.0834 27.4220 1.7145 12.0310 6.0875 21.2253 12.1927 0.8421 12.3637 3.1599 9.5438 3.6343 12.4811 2.8327 22.9713 162.5427 13.2668 56.8037 106.3226 84.9125 291.2824 73.6515 18.8392 31.2007 63.7007 34.2285 41.1082 22.0255 28.1668 28.6615 40.7968 28.2013 33.1442 20.7957 25.3032 39.3045 24.5895 21.1401 27.8549 11.1778
temp: 298.150 k
press: 1.00000 atm
elementType: 7 7 6 6 6 6 6 6 6 6 6 6 6 6 6 6 6 1 1 1 1 1 1 1 1 1 1 1 1 1 1 1 1 1 1 1 1 1 1
symmnumber: 1
zpe: 886366.3 jmol-1
zpe.correction: 0.337599 hartree
zpe.thermalcorrener: 0.354487 hartree
zpe.thermalcorrenthalpy: 0.355432 hartree
zpe.thermalcorrgfe: 0.294473 hartree
zpe.sumelectzpe: -692.995886 hartree
zpe.sumelectthermal: -692.978998 hartree
zpe.sumelectthermalent: -692.978054 hartree
zpe.sumelectthermalfe: -693.039012 hartree
dipole: -2.0698 -0.7613 0.3829
dipole: 2.2383
quadrupole: -99.8937 -101.2590 -98.6039
quadrupole: 2.8924 1.1063 4.6639
quadrupole: 0.0252 -1.3401 1.3149 2.8924 1.1063 4.6639
hfenergy: -693.3334851 hartree
pointgroup: C01 [X(C15H22N2)]
dipole: 0.8093545 -0.3059832 -0.1637847 debye
polarizability: 210.8795476|-16.536001|147.7750664|-1.0740339|-11.6366586|157.6864981 unknown
InChI: InChI=1S/C15H22N2/c1-11-5-6-13-12(9-11)14(2)10-17(4)8-7-15(14,3)16-13/h5-6,9,16H,7-8,10H2,1-4H3
charge 0 multiplicity 1
39 atoms
N  0.58357 -1.23859 1.172347
N  1.738688 1.595253 0.446742
C  0.720857 -0.175657 -1.010324
C  1.481317 -1.190675 -0.022857
C  2.874066 -0.628281 0.35322
C  1.390592 1.240403 -0.931475
C  -0.68888 -0.124523 -0.408562
C  2.798842 0.753164 1.041843
C  0.721135 -0.605813 -2.495285
C  -0.693095 -0.749157 0.868589
C  1.626105 -2.622646 -0.599361
C  -1.858483 0.453285 -0.917049
C  1.900025 3.025292 0.721927
C  -1.873918 -0.796768 1.640714
C  -3.069255 0.419176 -0.163026
C  -3.04899 -0.2084 1.107681
C  -4.343102 1.041365 -0.713009
H  3.4788 -0.562619 -0.57296
H  3.400938 -1.338021 1.020429
H  2.270325 1.268911 -1.631102
H  0.663639 1.982987 -1.310345
H  0.718488 -1.975331 1.865847
H  2.579292 0.625267 2.120277
H  3.804367 1.242525 0.963239
H  0.178987 -1.553151 -2.65146
H  0.221215 0.168036 -3.108247
H  1.750244 -0.719267 -2.886003
H  2.09452 -3.284319 0.15533
H  0.638854 -3.045327 -0.857006
H  2.262349 -2.646388 -1.501939
H  -1.856586 0.932578 -1.905912
H  1.9955 3.184141 1.812457
H  1.008515 3.579783 0.377937
H  2.803278 3.479765 0.235959
H  -1.890442 -1.270331 2.6290
H  -3.973159 -0.240985 1.698712
H  -4.64119 0.581454 -1.675219
H  -5.185577 0.916772 -0.010085
H  -4.221732 2.126591 -0.897424
