program: Gaussian 09
title: 000114855
version: EM64L-G09RevD.01
frameworkgroup: C1[X(C19H14O7)]
method: RPBEPBE
basis: SDD
operation: Freq
keyword: #pfreq=noraman
keyword: PBEPBE/SDD
title: #p freq=noraman PBEPBE/SDD
converged: YES YES NO NO
title: Mulliken charges:
elementType: O O O O O O O C C C C C C C C C C C C C C C C C C C H H H H H H H H H H H H H H
charge: -0.217667 -0.197613 -0.428726 -0.306082 -0.255051 -0.252277 -0.261521 -0.013082 -0.135923 0.072008 0.269978 0.129792 -0.275931 0.092892 -0.562787 -0.110881 0.223656 0.095440 0.040017 0.247696 0.225918 -0.417857 -0.387927 -0.190974 -0.516418 -0.515914 0.277388 0.272837 0.285877 0.260672 0.360238 0.261065 0.261647 0.239044 0.207862 0.234610 0.273905 0.273938 0.233152 0.207002
chargesum: 0.00000
title: Mulliken charges with hydrogens summed into heavy atoms:
elementType: O O O O O O O C C C C C C C C C C C C C C C C C C C
charge: -0.217667 -0.197613 -0.068488 -0.306082 -0.255051 -0.252277 -0.261521 -0.013082 0.141466 0.072008 0.269978 0.129792 -0.003094 0.092892 -0.276911 0.149791 0.223656 0.095440 0.040017 0.247696 0.225918 -0.156792 -0.126280 0.048070 0.199958 0.198178
polarizability: 3.38131119e+02 -4.53760393e+00 2.70411032e+02 3.06279857e-01 -3.03293824e-01 1.21719423e+02
1716.lowfreq: -4.1220 -0.0004 -0.0002 0.0005 4.7414 6.3333 36.0824 41.9188 61.5706
frequency: 35.9090 41.7762 61.5558 66.4310 97.9697 103.0300 119.3777 124.0244 157.7000 164.8676 171.3729 194.8381 203.9902 219.1634 239.2671 251.1357 270.5225 276.9171 295.7697 306.7387 312.6171 325.7461 340.9434 357.9373 390.7827 417.5270 453.9103 458.3043 484.1606 500.4568 514.8997 552.7705 556.1229 583.6649 595.9769 604.0273 606.6489 625.5844 638.3496 655.9944 696.7483 719.5405 735.2140 743.3202 759.4591 784.3663 807.3201 808.9259 834.3921 857.6015 862.7350 884.5567 887.9100 901.2352 905.5707 920.2004 930.3703 944.7763 975.3789 998.8811 1014.8670 1022.2944 1053.9570 1067.4655 1089.1424 1106.7847 1110.1943 1114.7866 1121.7638 1146.7402 1156.0496 1157.8826 1171.1839 1198.2955 1218.9130 1233.7619 1249.3501 1265.3387 1288.0763 1293.9892 1310.5182 1323.6210 1370.4457 1378.3564 1395.2226 1414.4112 1424.7672 1432.3749 1447.9494 1452.4168 1459.7687 1468.4249 1471.1368 1479.1429 1541.1630 1569.4114 1591.2565 1605.1428 1610.1822 1648.2575 2980.0065 2982.8057 3093.2740 3095.7872 3125.2968 3126.1734 3128.7840 3150.4981 3172.9958 3184.0394 3200.0759 3213.8619 3246.0732 3557.0905
redmass: 6.3211 5.1410 5.1679 5.2788 6.2779 6.1360 3.2131 3.8619 1.5325 2.3159 1.8671 3.9559 3.4056 3.6201 4.6027 3.6319 4.3521 7.0941 2.7627 3.1424 2.4485 3.9128 4.5540 5.9686 6.4466 8.0864 5.5873 7.7804 5.2769 4.8819 5.4951 6.3987 9.1448 5.6467 5.8807 5.4704 5.9208 8.0685 5.5343 5.6857 4.6097 6.2420 2.8541 5.6730 1.6727 2.1947 5.5041 3.8632 5.3753 1.9363 4.0966 1.4232 1.7921 3.3377 7.0924 5.6170 4.7503 4.0184 1.3226 5.2830 4.4304 5.9895 4.8471 2.2533 3.3629 1.3839 1.5416 1.7121 1.3255 1.5753 1.4287 1.7014 1.2466 2.1774 2.2448 1.8117 4.0479 1.6949 3.8204 2.1508 2.3777 1.7385 5.0603 6.0250 7.0971 1.6348 2.9791 1.5066 1.3200 1.1382 1.4701 1.1340 2.5952 1.1255 5.9762 7.6283 8.1832 7.4148 7.6660 10.2719 1.0327 1.0329 1.0988 1.0992 1.1053 1.0896 1.1044 1.0875 1.0925 1.0991 1.0932 1.0883 1.1110 1.0661
irintensity: 0.6373 1.6051 0.8494 0.6554 0.0395 7.0018 6.8679 1.8164 0.0380 4.9037 0.2346 0.3809 5.0568 7.4668 3.0711 6.0980 11.1522 0.5074 68.6983 18.6545 26.9213 35.0061 4.4302 3.3132 0.3465 10.8387 4.8846 4.0879 0.6200 14.6620 10.3417 13.7232 4.1303 5.3228 9.0099 3.5026 10.3934 14.7052 20.4738 5.1650 8.6814 17.4337 23.6239 2.9547 83.6211 25.8046 28.3410 30.1852 34.9353 42.2374 31.0821 1.9709 24.1960 169.3266 36.9944 7.1420 117.6087 69.5266 2.3185 12.4088 71.0947 38.5546 194.9056 4.2541 34.5988 26.4582 23.7954 98.0228 47.8716 12.1821 7.8777 46.9428 1.5310 6.1023 13.6603 98.2190 61.7044 79.1413 122.1382 76.2764 13.5430 20.8413 56.1282 113.2021 32.4275 65.9536 1.0621 28.6607 58.3910 84.9793 57.1139 16.3009 28.9437 149.9218 111.9856 267.5462 136.4860 97.1282 192.2206 365.6036 3.2859 102.5965 20.5131 58.5534 21.4390 7.5950 8.7450 8.7004 3.8046 7.1196 0.4435 0.9326 3.2059 15.3045
temp: 298.150 k
press: 1.00000 atm
elementType: 8 8 8 8 8 8 8 6 6 6 6 6 6 6 6 6 6 6 6 6 6 6 6 6 6 6 1 1 1 1 1 1 1 1 1 1 1 1 1 1
symmnumber: 1
zpe: 760040.5 jmol-1
zpe.correction: 0.289484 hartree
zpe.thermalcorrener: 0.311419 hartree
zpe.thermalcorrenthalpy: 0.312363 hartree
zpe.thermalcorrgfe: 0.239321 hartree
zpe.sumelectzpe: -1257.077079 hartree
zpe.sumelectthermal: -1257.055144 hartree
zpe.sumelectthermalent: -1257.054200 hartree
zpe.sumelectthermalfe: -1257.127242 hartree
dipole: 2.8257 -2.2139 2.1442
dipole: 4.1814
quadrupole: -155.1007 -134.1649 -152.0064
quadrupole: 6.1998 14.5499 10.3217
quadrupole: -8.0101 12.9258 -4.9157 6.1998 14.5499 10.3217
hfenergy: -1257.3665628 hartree
pointgroup: C01 [X(C19H14O7)]
dipole: 1.1576402 0.787758 -0.8634605 debye
polarizability: 338.3858032|-0.1774078|270.1013596|-3.2287272|-1.0801404|121.7744111 unknown
InChI: InChI=1S/C19H14O7/c1-22-9-4-3-5-10-13(9)16(20)14-11(23-2)8-12-15(17(14)25-10)19(21)6-7-24-18(19)26-12/h3-8,18,21H,1-2H3
charge 0 multiplicity 1
40 atoms
O  -3.888756 -1.176839 -0.315059
O  -5.132071 0.713179 0.536583
O  -2.791862 1.879108 -1.678563
O  0.058314 1.370282 -0.263977
O  0.2421 -3.612004 0.094217
O  2.439573 -1.745206 0.989612
O  4.807746 -0.124126 0.067825
C  -2.917714 1.092792 -0.441743
C  -4.246402 0.253101 -0.531855
C  -1.871162 0.011068 -0.285496
C  -2.489867 -1.24906 -0.195886
C  -0.481841 0.076699 -0.199386
C  -3.150781 1.923427 0.812148
C  0.335017 -1.085068 -0.00698
C  -1.768305 -2.43934 -0.063847
C  -4.388708 1.65778 1.297531
C  -0.354202 -2.359129 0.01271
C  1.76358 -0.876937 0.340688
C  2.342517 0.455046 -0.011245
C  1.454535 1.55827 -0.208562
C  3.748429 0.774439 -0.002942
C  1.870274 2.89598 -0.306399
C  4.177217 2.123748 -0.071669
C  3.249434 3.172398 -0.21072
C  1.529044 -3.909562 -0.557791
C  4.758142 -1.448187 -0.574295
H  -4.781929 0.327447 -1.487663
H  -2.409051 2.590875 1.247292
H  -2.248977 -3.418669 -0.05296
H  -4.928333 2.045858 2.160334
H  -1.918057 2.348139 -1.651201
H  1.1250 3.684563 -0.437193
H  5.253758 2.312154 -0.044038
H  3.603768 4.20626 -0.271616
H  1.67595 -3.272534 -1.450482
H  1.452942 -4.967094 -0.856316
H  2.350285 -3.750859 0.156347
H  4.386891 -2.195054 0.142627
H  5.799233 -1.655309 -0.868655
H  4.107971 -1.429135 -1.469776
