program: Gaussian 09
title: 000114854
version: EM64L-G09RevD.01
frameworkgroup: C1[X(C19H23N5O4)]
method: RPBEPBE
basis: SDD
operation: Freq
keyword: #p
keyword: freq=noraman
keyword: PBEPBE/SDD
title: #p freq=noraman PBEPBE/SDD
converged: YES YES NO NO
title: Mulliken charges:
elementType: O O O O N N N N N C C C C C C C C C C C C C C C C C C C H H H H H H H H H H H H H H H H H H H H H H H
charge: -0.322331 -0.472904 -0.454452 -0.435197 -0.190356 -0.082383 -0.373491 -0.214641 -0.074422 -0.217572 -0.004981 -0.153109 -0.065990 -0.335862 0.245996 -0.208071 -0.130585 0.207626 -0.010529 -0.630922 -0.340534 -0.698950 0.526152 -0.395611 -0.432262 -0.228410 -0.224814 -0.240329 0.233073 0.260697 0.234276 0.282312 0.190459 0.225961 0.406415 0.376784 0.287362 0.254772 0.352089 0.342392 0.222725 0.215492 0.211831 0.258480 0.208410 0.251643 0.230229 0.227588 0.226845 0.228251 0.230847
chargesum: 0.00000
title: Mulliken charges with hydrogens summed into heavy atoms:
elementType: O O O O N N N N N C C C C C C C C C C C C C C C C C C C
charge: -0.322331 -0.066489 -0.077667 -0.083108 -0.190356 -0.082383 -0.031099 -0.214641 -0.074422 0.015501 0.255716 0.081167 0.216323 0.080557 0.245996 0.079291 -0.130585 0.207626 0.244243 -0.192705 -0.088890 -0.020229 0.526152 -0.165382 -0.204674 -0.001565 0.003437 -0.009482
polarizability: 3.07119658e+02 1.79991798e+01 2.46078895e+02 7.62955944e+00 -9.86006263e+00 2.04369195e+02
1716.lowfreq: -0.0008 -0.0007 0.0001 0.6242 5.1629 9.3408 15.9786 16.8228 28.0313
frequency: 14.8781 16.8108 27.8621 32.7934 42.2663 52.8193 72.8925 82.9265 95.6692 108.9356 117.2259 144.4436 159.8470 166.5256 193.0714 218.8897 226.9758 252.0258 261.6967 268.5175 287.9541 301.7510 318.3834 330.0907 341.0997 360.6035 383.4351 393.1681 403.5371 443.7672 458.7141 495.6937 500.2638 527.8358 538.9523 547.9436 554.8615 567.5510 591.9286 600.9563 616.5071 617.6517 638.1824 658.7254 664.0808 699.4582 705.9117 748.6490 761.2482 787.0826 791.7946 808.4380 829.1355 839.6433 848.0045 854.0265 875.8011 889.6658 904.0512 922.0410 925.3256 941.6879 946.9163 958.8359 976.7375 984.9724 989.3907 990.2136 996.5697 1016.7215 1019.3854 1027.0415 1037.8290 1056.7349 1067.0642 1085.0467 1092.1586 1096.5046 1098.8634 1115.3995 1139.3141 1151.9548 1173.4050 1176.9299 1188.2834 1193.6968 1202.9133 1215.6847 1225.5058 1244.6700 1248.3427 1271.4285 1278.9331 1285.5134 1291.4216 1296.7426 1314.8255 1318.3617 1320.6066 1332.3402 1335.6193 1337.9254 1347.5004 1354.6886 1376.8361 1381.7360 1382.3980 1383.2657 1384.1423 1389.8878 1423.2496 1440.8574 1446.5549 1460.2806 1460.9259 1472.7804 1482.3680 1484.3587 1493.2774 1500.8342 1541.9595 1593.9855 1614.3588 1619.0330 2751.9166 2945.9669 2970.4536 2979.6842 2984.7434 2988.3299 2994.2108 3015.5384 3043.7281 3062.4969 3078.0092 3081.0375 3101.9347 3109.5970 3115.1594 3133.1103 3145.6289 3164.4762 3167.0230 3261.8306 3440.5401 3528.8862 3545.2161
redmass: 5.7744 5.9611 6.0484 3.7123 6.6177 6.5401 5.2790 5.2405 3.4385 3.3776 4.8883 5.2509 5.6459 6.7335 4.5453 4.3734 1.1154 5.8581 5.4232 4.3788 5.0329 4.0840 4.5356 4.8880 2.1195 5.5966 3.7287 4.3140 2.8147 1.1871 2.9852 2.7281 2.9108 5.1771 1.9623 1.2606 5.3916 1.8571 4.3861 5.1247 5.5867 6.3003 4.7976 7.1244 8.4792 5.1395 1.8451 2.1074 3.9533 6.8042 4.3784 3.3481 1.5433 2.9342 3.7177 1.2524 6.0952 3.1059 1.5907 1.6556 1.3645 1.7794 1.1970 2.5458 1.3893 4.3147 3.3937 6.1520 1.3174 2.7541 3.4602 2.1893 3.3276 2.0258 3.5090 3.8031 2.5848 2.2502 2.9489 1.9996 2.2673 3.9807 1.0540 1.1849 1.1204 1.4748 1.5305 2.3777 1.8496 1.3869 1.5472 1.2135 2.2608 1.3201 1.5623 2.6790 1.4707 1.4060 1.3651 1.3714 1.5077 1.8023 1.2867 1.3816 3.4583 1.8416 1.8089 1.5549 2.2885 1.5785 3.1040 2.1291 1.8320 1.0803 1.0880 1.2090 1.0531 2.2677 1.3406 4.1602 5.7856 6.0273 6.3642 6.5548 1.0718 1.0691 1.0827 1.0607 1.0380 1.0854 1.0867 1.0841 1.0996 1.0867 1.0944 1.0997 1.0998 1.0886 1.0873 1.0896 1.0954 1.1013 1.0925 1.0989 1.0643 1.0772 1.0653
irintensity: 0.1002 0.0040 0.4450 0.0034 0.9476 0.9931 1.0850 1.8422 0.3700 2.8144 0.4406 16.4443 1.0838 5.0492 1.3543 0.5384 0.0600 3.9286 2.3166 8.3876 0.3187 9.7811 1.4359 12.4668 0.3267 10.7287 4.4844 4.0319 0.0343 144.1448 1.0234 36.6368 1.5431 27.5835 50.5569 165.0574 11.1676 92.5468 4.4846 16.8541 4.7249 0.2189 19.5310 24.1373 10.0206 11.7080 54.6216 23.9639 29.5180 8.7349 29.8407 0.9052 19.3407 26.2590 7.8919 0.3504 0.8012 20.4482 0.3462 15.2554 49.2239 10.7199 71.4839 107.0184 0.1377 146.7669 36.8521 0.5728 0.0296 17.9623 48.4416 8.3725 38.0564 20.9491 2.8336 46.3195 5.2452 8.5359 7.7899 15.3009 47.7607 57.9248 0.1367 26.4159 0.7705 62.8669 18.2399 0.3997 9.6084 32.2282 63.2312 10.8004 87.2058 0.2605 21.1887 31.1880 2.6517 31.2204 21.7324 106.4388 5.1159 29.7624 13.8373 20.2211 45.9017 52.8365 17.7945 99.8933 8.1620 36.0679 89.7150 7.6340 12.9500 4.8362 4.6145 18.6868 8.9118 18.9612 275.7887 59.6205 28.5565 1.7414 186.5998 603.4285 1577.8220 49.8725 22.8177 16.3081 45.4658 13.7732 80.5993 10.6682 14.8399 4.8994 42.8564 41.7203 19.8308 12.4511 9.6548 6.4622 35.2619 21.1346 11.8481 2.8428 38.8488 75.5674 6.6869
temp: 298.150 k
press: 1.00000 atm
elementType: 8 8 8 8 7 7 7 7 7 6 6 6 6 6 6 6 6 6 6 6 6 6 6 6 6 6 6 6 1 1 1 1 1 1 1 1 1 1 1 1 1 1 1 1 1 1 1 1 1 1 1
symmnumber: 1
zpe: 1068135.3 jmol-1
zpe.correction: 0.406831 hartree
zpe.thermalcorrener: 0.432100 hartree
zpe.thermalcorrenthalpy: 0.433044 hartree
zpe.thermalcorrgfe: 0.348609 hartree
zpe.sumelectzpe: -1310.402588 hartree
zpe.sumelectthermal: -1310.377320 hartree
zpe.sumelectthermalent: -1310.376375 hartree
zpe.sumelectthermalfe: -1310.460810 hartree
dipole: -5.0058 -1.3195 -1.0757
dipole: 5.2874
quadrupole: -176.1743 -165.7149 -165.5082
quadrupole: -7.2513 -2.4458 6.4163
quadrupole: -7.0418 3.4176 3.6243 -7.2513 -2.4458 6.4163
hfenergy: -1310.8094196 hartree
pointgroup: C01 [X(C19H23N5O4)]
dipole: -1.9404176 0.6058692 0.4415612 debye
polarizability: 305.1547337|-20.749561|248.4287676|-8.8060357|-8.3922445|203.9842459 unknown
InChI: InChI=1S/C19H23N5O4/c1-11(7-12-5-3-2-4-6-12)23-17-14-18(21-9-20-17)24(10-22-14)19-16(27)15(26)13(8-25)28-19/h2-6,9-11,13,15-16,19,23,25-27H,7-8H2,1H3
charge 0 multiplicity 1
51 atoms
O  4.036582 -1.683189 0.036331
O  3.807312 1.714288 -1.353428
O  5.811343 0.089881 -2.015868
O  5.791126 -2.724848 1.970009
N  1.924954 -0.57964 -0.000283
N  -0.022827 -1.254615 1.007866
N  -2.438148 0.66598 1.1257
N  1.23627 1.722124 -0.683168
N  -1.064991 2.23443 -0.01481
C  4.081686 0.680959 -0.386917
C  3.265339 -0.625303 -0.609581
C  5.526551 0.159506 -0.586291
C  5.49874 -1.26755 -0.004475
C  6.022414 -1.385487 1.431788
C  1.036243 0.493118 -0.103836
C  1.232543 -1.605628 0.667025
C  -0.156705 0.059251 0.524166
C  -1.244753 0.98737 0.556364
C  -3.611554 1.568931 1.168097
C  -4.899298 0.719861 1.358389
C  0.13246 2.52619 -0.591298
C  -3.457637 2.630648 2.28039
C  -5.152579 -0.280925 0.238864
C  -5.527887 0.165677 -1.055269
C  -5.005047 -1.674296 0.456091
C  -5.744509 -0.754231 -2.103934
C  -5.219037 -2.600021 -0.591399
C  -5.588841 -2.142233 -1.875962
H  3.931697 1.021443 0.659678
H  3.170447 -0.823907 -1.696899
H  6.265046 0.806991 -0.072294
H  6.014908 -1.971598 -0.678653
H  5.549042 -0.610628 2.074084
H  7.116612 -1.244764 1.447579
H  2.802997 1.950789 -1.245174
H  5.334313 0.868882 -2.421176
H  1.701148 -2.563011 0.873765
H  -3.651776 2.0894 0.192721
H  4.834053 -2.940981 1.820899
H  -2.52755 -0.287793 1.486632
H  -5.742552 1.432043 1.435425
H  -4.839667 0.196621 2.334069
H  -4.316013 3.327342 2.266736
H  -2.536457 3.214618 2.119476
H  -3.409857 2.156259 3.277739
H  0.223471 3.52215 -1.033926
H  -5.655629 1.239806 -1.241397
H  -4.731452 -2.041172 1.454246
H  -6.03675 -0.392117 -3.09612
H  -5.099251 -3.672957 -0.404164
H  -5.757131 -2.856862 -2.68921
