program: Gaussian 09
title: 000114852
version: EM64L-G09RevD.01
frameworkgroup: C1[X(C18H22O3)]
method: RPBEPBE
basis: SDD
operation: Freq
keyword: #pfreq=noraman
keyword: PBEPBE/SDD
title: #p freq=noraman PBEPBE/SDD
converged: YES YES NO NO
title: Mulliken charges:
elementType: O O O C C C C C C C C C C C C C C C C C C H H H H H H H H H H H H H H H H H H H H H H
charge: -0.435466 -0.188077 -0.436846 -0.140738 0.296075 -0.100936 -0.168524 -0.522294 -0.577993 -0.486359 -0.506339 0.007833 -0.132528 -0.791990 0.255169 -0.581198 0.302648 -0.345458 -0.537137 -0.446375 0.287261 0.217560 0.242111 0.208980 0.212437 0.227488 0.240183 0.235689 0.226153 0.199021 0.219472 0.216245 0.219430 0.242697 0.235734 0.241844 0.225324 0.229949 0.222537 0.357861 0.256253 0.219009 0.353300
chargesum: 0.00000
title: Mulliken charges with hydrogens summed into heavy atoms:
elementType: O O O C C C C C C C C C C C C C C C C C C
charge: -0.077605 -0.188077 -0.083547 0.076822 0.296075 0.141174 0.040455 -0.082369 -0.102122 -0.061186 -0.070622 0.007833 0.086902 -0.071715 0.255169 -0.125925 0.302648 -0.122922 -0.280884 -0.227367 0.287261
polarizability: 2.64900957e+02 -3.04874493e+00 1.90856005e+02 6.61656523e+00 4.14628654e+00 1.26904554e+02
1716.lowfreq: -13.2538 -7.3888 -0.0001 -0.0001 0.0007 7.2377 28.7757 43.6522 62.2803
frequency: 28.5871 43.6096 62.2555 95.9610 113.9920 153.3733 165.7790 203.3582 207.8951 230.1392 232.8762 238.0731 268.0112 274.9855 297.3213 337.7920 345.5888 355.6515 369.9822 373.3327 394.2799 409.5987 438.8972 445.9820 457.7002 485.2072 503.7333 520.9497 528.6420 560.7577 581.7067 604.5195 629.2327 698.1254 710.7060 724.5448 750.1528 776.7815 806.1972 819.2304 827.5061 847.7260 874.9205 891.3680 904.4352 917.6977 926.3091 937.8040 957.5075 983.9040 1001.6310 1010.0194 1017.8715 1034.7914 1053.2376 1059.1739 1075.3578 1089.5062 1102.8813 1119.1683 1129.2838 1135.5833 1150.1748 1163.0453 1171.3773 1178.9503 1185.9367 1210.2365 1219.2207 1227.5693 1237.6430 1244.2882 1248.2219 1257.4505 1264.4042 1279.6422 1288.4479 1294.4236 1299.4979 1317.7468 1326.7055 1328.8224 1338.0348 1341.3318 1354.5689 1357.2795 1378.5350 1382.7632 1387.1393 1442.4560 1458.6411 1461.3486 1470.4185 1471.7255 1473.1615 1488.8318 1490.8685 1495.9559 1586.6491 1631.6686 1649.1621 2896.9766 2904.3069 2911.8326 2960.0175 2963.2764 2974.8735 2976.1206 2988.6537 2995.0340 3022.6431 3023.9719 3038.1180 3038.5009 3049.0311 3084.3674 3091.3746 3102.9023 3112.9371 3142.2228 3151.3643 3510.5071 3583.1295
redmass: 4.8323 7.0677 3.9297 4.8041 5.1584 2.2627 3.7448 3.2057 1.6984 3.8515 2.1772 3.3652 2.9775 3.2742 3.0929 3.2091 1.1183 2.1966 2.2969 2.5742 2.5740 2.6583 3.2639 2.8842 3.8053 2.6517 4.3857 3.3380 4.1219 2.7001 3.3614 4.2117 3.0481 3.0422 4.2549 4.1854 4.8525 2.0179 1.9633 1.8974 2.4918 1.9046 2.2622 1.7605 2.3292 2.5100 1.3936 1.7981 2.4705 1.8842 1.9317 2.5758 2.0119 2.0499 2.9485 2.8129 3.0069 1.9270 2.1984 2.3082 1.9323 1.3935 1.4148 1.4650 1.7805 1.5284 1.6470 1.9385 1.6504 1.1801 1.3887 1.5272 1.8591 2.5138 1.5460 1.4683 1.3564 1.3631 1.4733 1.3600 1.3239 1.5401 1.5272 1.4269 1.5267 1.6106 1.3666 2.7313 1.5941 2.9235 1.1750 1.0736 1.0940 1.0763 1.0881 1.0767 1.0618 2.6854 7.1648 6.4351 12.0371 1.0806 1.0801 1.0806 1.0659 1.0731 1.0691 1.0649 1.0599 1.0368 1.0722 1.0823 1.0983 1.1000 1.1023 1.1004 1.1028 1.0984 1.0890 1.0916 1.0935 1.0653 1.0660
irintensity: 0.1422 3.9372 1.8312 1.2204 0.8357 5.1020 0.3421 11.4010 5.2910 12.1514 0.8393 6.1012 2.6776 2.7133 1.6090 10.5283 132.6718 46.0789 59.5501 31.0496 30.1705 15.1425 5.1712 0.9443 0.5472 2.9596 2.6933 0.7711 2.5189 8.5975 5.3747 3.8505 2.6245 2.5013 0.4001 1.9531 0.3574 25.7415 17.7272 6.3454 4.4130 8.7491 8.5330 21.7306 81.8561 0.3524 0.3334 9.9673 20.2974 7.0492 10.4745 70.5309 15.3181 39.2778 8.9398 22.6526 2.9079 0.9725 22.5481 32.2076 4.3638 18.5036 91.9213 0.4711 8.2514 54.7117 6.0643 10.3478 5.1935 20.6524 0.6452 1.2518 36.9057 23.0381 5.2507 25.4179 16.8232 0.1929 7.6786 0.2075 3.5469 1.7407 0.7438 1.6447 6.1437 8.1408 20.7657 19.7410 7.2537 6.2064 6.5388 4.9153 4.3915 13.0890 9.3379 8.9256 12.3649 96.3514 29.9436 52.8480 162.6364 11.3910 4.0990 56.5041 25.3876 5.7111 23.0321 54.3903 25.3027 20.4020 6.7199 41.3144 10.2094 66.2215 52.5704 29.9035 15.5676 22.5971 20.4853 11.2590 13.9257 8.4086 39.4949
temp: 298.150 k
press: 1.00000 atm
elementType: 8 8 8 6 6 6 6 6 6 6 6 6 6 6 6 6 6 6 6 6 6 1 1 1 1 1 1 1 1 1 1 1 1 1 1 1 1 1 1 1 1 1 1
symmnumber: 1
zpe: 946364.0 jmol-1
zpe.correction: 0.360451 hartree
zpe.thermalcorrener: 0.379144 hartree
zpe.thermalcorrenthalpy: 0.380088 hartree
zpe.thermalcorrgfe: 0.314522 hartree
zpe.sumelectzpe: -923.219052 hartree
zpe.sumelectthermal: -923.200359 hartree
zpe.sumelectthermalent: -923.199415 hartree
zpe.sumelectthermalfe: -923.264981 hartree
dipole: 2.5176 -0.9420 -0.8151
dipole: 2.8089
quadrupole: -139.9382 -123.5962 -124.6593
quadrupole: -12.5906 2.0044 -1.7011
quadrupole: -10.5403 5.8017 4.7386 -12.5906 2.0044 -1.7011
hfenergy: -923.5795027 hartree
pointgroup: C01 [X(C18H22O3)]
dipole: 0.9868596 -0.3829768 -0.3173589 debye
polarizability: 264.8662468|-3.5756251|191.0070784|6.4732776|3.2690587|126.7881901 unknown
InChI: InChI=1S/C18H22O3/c1-18-7-6-13-12-5-3-11(19)8-10(12)2-4-14(13)15(18)9-16(20)17(18)21/h3,5,8,13-16,19-20H,2,4,6-7,9H2,1H3
charge 0 multiplicity 1
43 atoms
O  -5.293214 1.38858 0.353275
O  -4.766794 -1.476011 -0.121525
O  6.192083 0.086237 0.392938
C  -1.774797 0.546125 -0.375845
C  -2.37914 -0.774537 0.20042
C  -0.300317 0.721359 0.024081
C  0.501212 -0.494694 -0.54731
C  -1.628551 -1.981942 -0.399585
C  -2.834697 1.631929 -0.046641
C  -0.104383 -1.865395 -0.116593
C  0.334584 2.030291 -0.491067
C  -3.863632 -0.602845 -0.134999
C  -4.146849 0.901837 -0.407266
C  -2.365879 -0.841913 1.766031
C  2.00494 -0.360114 -0.252837
C  1.756122 2.192413 0.083257
C  2.593812 0.917324 0.00105
C  2.861287 -1.490319 -0.283468
C  3.987628 1.023689 0.210924
C  4.251923 -1.388026 -0.072803
C  4.815468 -0.115577 0.17591
H  -1.782983 0.430564 -1.485995
H  -0.216311 0.722096 1.131798
H  0.376933 -0.434183 -1.654973
H  -1.797774 -2.008513 -1.49533
H  -2.019245 -2.932588 0.009461
H  -2.703474 2.558017 -0.629466
H  -2.844485 1.898569 1.025555
H  0.102903 -2.035357 0.957933
H  0.40233 -2.683987 -0.661144
H  -0.281656 2.90305 -0.202819
H  0.368817 2.00663 -1.599838
H  -4.341155 0.996396 -1.501891
H  -2.889934 -1.758736 2.089339
H  -1.335621 -0.876088 2.155557
H  -2.87721 0.019335 2.230714
H  1.678631 2.493174 1.149193
H  2.288039 3.017381 -0.428037
H  2.44417 -2.483173 -0.478967
H  -6.01165 0.703971 0.285045
H  4.4478 1.999155 0.403603
H  4.883657 -2.285404 -0.104754
H  6.68311 -0.771119 0.345167
