program: Gaussian 09
title: 000114839
version: EM64L-G09RevD.01
frameworkgroup: C1[X(C6H10O5)]
method: RPBEPBE
basis: SDD
operation: Freq
keyword: #pfreq=noraman
keyword: PBEPBE/SDD
title: #p freq=noraman PBEPBE/SDD
converged: YES YES NO NO
title: Mulliken charges:
elementType: O O O O O C C C C C C H H H H H H H H H H
charge: -0.415546 -0.476001 -0.416921 -0.141194 -0.127097 -0.067401 -0.168454 -0.559257 -0.326852 0.199047 -0.128061 0.286553 0.191150 0.303144 0.215721 0.244526 0.187245 0.320617 0.360757 0.347413 0.170612
chargesum: 0.00000
title: Mulliken charges with hydrogens summed into heavy atoms:
elementType: O O O O O C C C C C C
charge: -0.094929 -0.115244 -0.069508 -0.141194 -0.127097 0.219152 0.022696 -0.040393 0.104919 0.199047 0.042551
polarizability: 1.00405615e+02 -1.18503674e+00 6.95985398e+01 2.66385809e+00 -5.35346801e+00 7.21491280e+01
1716.lowfreq: -13.7667 -6.3337 0.0007 0.0009 0.0012 8.0954 27.0370 42.1306 57.3830
frequency: 26.8393 42.0501 57.3597 80.0412 111.2820 136.3277 203.4023 217.9810 265.6298 296.5313 314.1876 322.2628 354.5383 406.7473 443.5172 462.3776 489.0284 514.3403 663.1570 701.1588 802.6368 832.1390 860.3915 907.7326 916.3435 975.1415 1003.4481 1031.3148 1047.1825 1055.6872 1097.3675 1140.5980 1163.4123 1200.6594 1245.0103 1260.2780 1305.6712 1322.8607 1353.9898 1372.5689 1385.2936 1387.8176 1396.0124 1423.9792 1468.6699 1610.8661 1655.9427 2858.6839 2929.0756 2950.4287 2954.2952 3003.7928 3077.9238 3086.0773 3503.0012 3526.1577 3564.9277
redmass: 9.1236 4.6244 4.7100 3.1733 6.4062 4.8538 6.6736 4.6350 4.5322 1.4841 1.9408 1.0654 4.7709 3.2144 2.6832 3.5643 2.8160 1.2351 4.2839 5.0645 2.0769 5.0824 3.2959 2.9306 2.2025 2.8022 2.2771 4.3385 1.7779 2.7387 2.8669 1.1444 1.1287 1.2599 1.4209 1.4728 1.3086 1.3039 1.4891 1.2141 1.2237 1.1825 1.5882 1.0900 1.0789 11.0675 8.8357 1.0861 1.0719 1.0656 1.0773 1.0965 1.0859 1.0922 1.0649 1.0660 1.0665
irintensity: 0.0612 5.1989 4.5330 4.8599 0.3210 18.2496 1.6624 17.3786 7.6507 35.6063 35.7939 124.4437 12.7297 26.7908 17.2423 7.1671 69.9295 195.2800 10.1680 20.0195 10.8623 9.4939 50.6675 35.4730 3.9186 44.6105 64.5950 80.5674 24.3099 22.9831 28.2067 12.1012 57.9944 0.9611 18.4792 109.7464 29.5971 6.0463 34.2234 1.4031 19.2115 22.7485 0.6987 27.7891 8.3253 122.3674 15.0436 109.8401 55.9689 47.6845 81.2523 22.0558 2.4464 10.4913 8.7627 4.0866 7.4553
temp: 298.150 k
press: 1.00000 atm
elementType: 8 8 8 8 8 6 6 6 6 6 6 1 1 1 1 1 1 1 1 1 1
symmnumber: 1
zpe: 417413.8 jmol-1
zpe.correction: 0.158985 hartree
zpe.thermalcorrener: 0.171842 hartree
zpe.thermalcorrenthalpy: 0.172786 hartree
zpe.thermalcorrgfe: 0.118201 hartree
zpe.sumelectzpe: -609.807464 hartree
zpe.sumelectthermal: -609.794607 hartree
zpe.sumelectthermalent: -609.793663 hartree
zpe.sumelectthermalfe: -609.848248 hartree
dipole: -3.3830 5.3245 -5.8332
dipole: 8.5919
quadrupole: -78.8442 -66.1336 -62.0901
quadrupole: -4.0600 -0.2627 2.7861
quadrupole: -9.8216 2.8890 6.9325 -4.0600 -0.2627 2.7861
hfenergy: -609.9664487 hartree
pointgroup: C01 [X(C6H10O5)]
dipole: -1.3156881 -2.3929021 1.9923766 debye
dipolederiv: -0.6919862 -0.0809504 0.0209371 -0.0056843 -0.4352343 -0.3333926 0.0860924 -0.3437831 -0.3550925 -0.4933286 0.0981456 -0.1978465 0.0874809 -0.7536761 -0.1737541 -0.2193186 -0.1795849 -0.4641735 -0.6789884 0.0024691 -0.1087724 -0.0185386 -0.2114847 0.088905 -0.1049959 0.1144136 -0.6896027 -0.5664798 0.0232179 0.0161972 -0.1078147 -0.4719557 0.2099006 0.1467603 0.207551 -0.4806028 -0.8198997 -0.0113807 0.0755454 -0.0337635 -0.3376264 0.0566431 0.1008656 0.0543977 -0.3374842 0.5327597 -0.0053774 -0.0275556 -0.0392556 0.3478811 0.2707301 0.0179228 0.2375002 0.3081578 0.1416014 0.0091339 0.0741873 0.0677551 0.5089197 0.1223034 0.1123962 0.1055376 0.357598 -0.6677023 -0.0696848 0.224642 -0.2491943 -0.243905 0.0658663 0.1067783 0.0338389 0.048477 0.3257426 0.1019649 0.0065787 0.0110051 0.1431943 -0.0803863 -0.0496966 -0.0806441 0.528491 0.9288939 0.1339784 -0.2052026 0.35872 0.4292415 -0.2802998 -0.3711939 -0.2200415 0.4341922 0.6997866 0.0222036 -0.0732552 -0.0971201 0.4830337 -0.2867321 -0.0150533 -0.309668 0.4219586 0.1436895 -0.0059695 -0.0073373 0.0272102 0.0458248 0.005304 -0.0088326 0.0030933 -0.0021324 0.0241736 0.0074262 -0.0568886 -0.001993 -0.0281644 0.0596366 -0.0102059 0.0360768 -0.2268807 0.2537313 0.0142185 0.0135021 0.0746418 0.0594582 -0.0654564 0.0561218 -0.0469201 0.0515898 0.0191509 0.0272201 -0.0177763 0.062033 0.0911556 0.0284123 -0.0404713 0.0747542 -0.1118951 0.1365873 -0.0200741 -0.0056555 0.0136389 -0.0332238 -0.0922115 0.0040934 -0.0440522 0.0070059 -0.1885768 -0.0867637 0.0856926 -0.1354541 -0.0203163 0.1060146 0.0528132 0.0644833 -0.0600131 0.3690205 0.0288691 -0.0416547 0.0339542 0.1569894 0.2118444 -0.068005 0.1148869 0.1135045 0.1330302 -0.1583323 0.0910112 -0.0961547 0.2752945 -0.0010979 0.1250074 0.0315412 0.2483348 0.4079131 0.0139485 0.0866226 0.0222818 0.1012596 -0.0973783 0.0847683 -0.0524411 0.2939549 -0.0091186 -0.0442629 0.0470288 0.026252 -0.1066659 0.1851485 -0.0058466 0.1990604 -0.0853876 unknown
polarizability: 100.2840347|0.9338078|71.1994528|-3.3793398|-5.477571|70.6697957 unknown
InChI: InChI=1S/C6H10O5/c7-2-4(9)1-5(10)6(11)3-8/h2,5-6,8,10-11H,1,3H2
charge 0 multiplicity 1
21 atoms
O  -0.577905 1.325858 1.303715
O  -1.968091 -1.7032 -0.377232
O  -3.309653 0.621755 -1.187778
O  1.711005 0.87603 -1.240262
O  4.245166 -0.209746 -0.387623
C  -0.677626 0.248239 0.302922
C  -1.98766 -0.538289 0.545759
C  0.566885 -0.654956 0.302939
C  -3.233529 0.319208 0.23948
C  1.780306 -0.018419 -0.365314
C  3.1517 -0.600934 0.067862
H  -0.743066 0.788099 -0.656857
H  -2.017013 -0.887135 1.602975
H  0.317723 -1.577251 -0.266036
H  0.825562 -0.99164 1.328946
H  -3.160393 1.287838 0.760739
H  -4.149418 -0.212392 0.583285
H  -0.395677 0.926354 2.194223
H  -2.6704 -2.349948 -0.112516
H  -3.073974 -0.2147 -1.67223
H  3.09266 -1.417071 0.834803
