program: Gaussian 09
title: 000114836
version: EM64L-G09RevD.01
frameworkgroup: C1[X(C2H5N3O2)]
method: RPBEPBE
basis: SDD
operation: Freq
keyword: #pfreq=noraman
keyword: PBEPBE/SDD
title: #p freq=noraman PBEPBE/SDD
converged: YES YES NO NO
title: Mulliken charges:
elementType: O O N N N C C H H H H H
charge: -0.237490 -0.242281 -0.393305 -0.376144 0.142687 0.351964 -0.597836 0.301175 0.281791 0.234634 0.234947 0.299858
chargesum: 0.00000
title: Mulliken charges with hydrogens summed into heavy atoms:
elementType: O O N N N C C
charge: -0.237490 -0.242281 -0.092130 -0.076286 0.142687 0.351964 0.153536
polarizability: 8.85728834e+01 -2.68905686e+00 5.08105781e+01 1.79046283e-02 1.29165830e-02 2.72605718e+01
1716.lowfreq: -1.9682 0.0005 0.0006 0.0008 2.7014 11.4694 61.3452 101.9065 121.2861
frequency: 61.3218 101.8975 121.2820 165.7420 217.2751 306.3536 399.6295 484.0899 502.7437 699.7394 711.2620 731.6116 921.2070 996.1697 1055.0280 1124.6955 1140.1725 1190.5813 1350.7906 1425.2568 1432.5529 1456.8537 1486.8078 1513.2946 1678.3734 2985.9993 3068.0761 3117.8767 3341.0918 3552.5251
redmass: 2.3720 1.4441 2.5737 5.7782 6.7061 5.0510 6.4832 1.2231 7.3839 5.6565 1.4469 4.0278 4.0583 5.6835 3.9673 1.2822 1.6142 2.5188 5.5806 1.2037 1.7576 1.2878 1.0445 1.3657 7.7818 1.0349 1.1030 1.0986 1.0760 1.0778
irintensity: 2.7940 0.0012 0.2372 0.9617 2.8689 16.3803 0.8333 94.9510 4.0906 77.7793 108.7216 2.4065 125.0727 171.5411 290.7967 0.0634 21.8969 105.8133 15.7133 34.8893 218.3669 50.7297 18.1443 101.6257 229.7884 56.4265 32.9890 1.2537 1.1842 21.5508
temp: 298.150 k
press: 1.00000 atm
elementType: 8 8 7 7 7 6 6 1 1 1 1 1
symmnumber: 1
zpe: 223344.6 jmol-1
zpe.correction: 0.085067 hartree
zpe.thermalcorrener: 0.093008 hartree
zpe.thermalcorrenthalpy: 0.093952 hartree
zpe.thermalcorrgfe: 0.052184 hartree
zpe.sumelectzpe: -393.299104 hartree
zpe.sumelectthermal: -393.291164 hartree
zpe.sumelectthermalent: -393.290220 hartree
zpe.sumelectthermalfe: -393.331988 hartree
dipole: 4.4444 -5.0366 0.0067
dipole: 6.7172
quadrupole: -44.4529 -41.2035 -40.4481
quadrupole: -2.1300 0.0159 -0.0196
quadrupole: -2.4180 0.8313 1.5867 -2.1300 0.0159 -0.0196
hfenergy: -393.3841718 hartree
pointgroup: C01 [X(C2H5N3O2)]
dipole: -1.741834 -1.9445253 0.4109806 debye
dipolederiv: -0.623446 0.0766428 -0.0119174 0.0298271 -0.9778563 0.1246599 -0.0027286 0.1236716 -0.3769902 -1.191196 -0.1345414 0.0418527 0.6432978 -0.2407843 0.0018477 -0.1154161 0.0131274 -0.1868908 -1.0859118 -0.3002798 0.065892 -0.3300915 -0.5297127 0.0078755 0.0772548 0.0092602 -0.5326912 -1.6772167 0.1777313 -0.0158874 -0.4088289 -0.1645966 -0.0206593 0.1027498 -0.0288545 -0.2880177 1.9319661 0.1708832 -0.0627749 0.2430518 0.1348766 -0.0296177 -0.0772961 -0.0285451 0.0137234 2.0064548 0.0361255 -0.0296202 -0.0678486 1.458466 -0.2197006 -0.0080231 -0.2208275 0.4002254 0.4982844 0.0287202 -0.0066167 -0.1847416 -0.0077465 0.0544439 0.0321903 0.0500049 0.2523648 0.1122846 0.0523063 -0.006003 0.0939221 0.119382 0.0479934 -0.0154575 0.0471671 0.3647654 0.1495757 -0.0447488 0.0076933 0.0722272 -0.0005107 0.0241595 -0.0147813 0.0265088 0.1345743 -0.0692866 -0.0197332 0.0707418 -0.0046403 0.1254638 0.0514909 0.1284349 0.0416388 -0.0930892 -0.0753729 -0.045866 -0.0577723 -0.0516721 0.0655447 -0.1115611 -0.1188194 -0.1015137 -0.030366 0.0238645 0.0027595 0.0044121 -0.0345031 0.0174738 0.069068 0.0118923 0.068362 0.3423918 unknown
polarizability: 88.5428225|2.5927344|49.9042883|-1.385165|-4.5746356|28.1969226 unknown
InChI: InChI=1S/C2H5N3O2/c1-3-2(6)4-5-7/h3-4H,1H3
charge 0 multiplicity 1
12 atoms
O  -0.666796 1.393816 -0.338578
O  2.992621 -0.420778 -0.029087
N  -1.549155 -0.733683 0.099533
N  0.776196 -0.457703 0.010909
N  1.94501 0.296474 -0.158889
C  -0.516633 0.173224 -0.097123
C  -2.953395 -0.30818 0.03382
H  -1.347113 -1.716928 0.286217
H  -2.965382 0.774433 -0.167309
H  -3.472477 -0.499336 0.990474
H  -3.490514 -0.827917 -0.780336
H  0.893438 -1.466621 0.21367
